BDBM50123333 2-(4-Bromo-phenyl)-7-methoxy-6-oxazol-5-yl-1H-quinolin-4-one::CHEMBL152910
SMILES: COc1cc2nc(cc(O)c2cc1-c1cnco1)-c1ccc(Br)cc1
InChI Key: InChIKey=KZHIIZNQJMPKSE-UHFFFAOYSA-N
Data: 1 IC50
Activity Spreadsheet -- Enzyme Inhibition Constant Data from BindingDB
Found 1 hit for monomerid = 50123333
Trg + Lig
Ki
nM
ΔG°
kcal/mole
IC50
nM
Kd
nM
EC50/IC50
nM
koff
s-1
kon
M-1s-1
pHTemp
°C
Inosine Monophosphate Dehydrogenase Type 2 (IMPDH2)
(Homo sapiens (Human))
BDBM50123333
(2-(4-Bromo-phenyl)-7-methoxy-6-oxazol-5-yl-1H-quin...)
Show SMILES COc1cc2nc(cc(O)c2cc1-c1cnco1)-c1ccc(Br)cc1
Show InChI InChI=1S/C19H13BrN2O3/c1-24-18-8-16-13(6-14(18)19-9-21-10-25-19)17(23)7-15(22-16)11-2-4-12(20)5-3-11/h2-10H,1H3,(H,22,23)
Reactome pathway
n/an/a 5n/an/an/an/an/an/a
Bristol-Myers Squibb PRI
Curated by ChEMBL
Assay Description
Inhibition of human inosine monophosphate dehydrogenase IMPDH II
Bioorg Med Chem Lett 13: 543-6 (2003)
BindingDB Entry DOI: 10.7270/Q2SJ1JZT