BDBM50123552 CHEMBL3621519
SMILES: CN1CCN(CC1)C(=O)c1ccc2c(c1)[nH]c1c(ccc(-c3cccc(NC(=O)c4ccccc4)c3C)c21)C(N)=O
InChI Key: InChIKey=ZSRQAHYBCDVDRA-UHFFFAOYSA-N
Data: 1 IC50
Activity Spreadsheet -- Enzyme Inhibition Constant Data from BindingDB
Found 1 hit for monomerid = 50123552
Trg + Lig
Ki
nM
ΔG°
kcal/mole
IC50
nM
Kd
nM
EC50/IC50
nM
koff
s-1
kon
M-1s-1
pHTemp
°C
Tyrosine-protein kinase BTK
(Homo sapiens (Human))
BDBM50123552
(CHEMBL3621519)
Show SMILES CN1CCN(CC1)C(=O)c1ccc2c(c1)[nH]c1c(ccc(-c3cccc(NC(=O)c4ccccc4)c3C)c21)C(N)=O
Show InChI InChI=1S/C33H31N5O3/c1-20-23(9-6-10-27(20)36-32(40)21-7-4-3-5-8-21)24-13-14-26(31(34)39)30-29(24)25-12-11-22(19-28(25)35-30)33(41)38-17-15-37(2)16-18-38/h3-14,19,35H,15-18H2,1-2H3,(H2,34,39)(H,36,40)
NCI pathway
Reactome pathway
n/an/a 7.20n/an/an/an/an/an/a
Bristol-Myers Squibb Pharmaceutical Research Institute
Curated by ChEMBL
Assay Description
Inhibition of human recombinant BTK
Bioorg Med Chem Lett 25: 4265-9 (2015)
BindingDB Entry DOI: 10.7270/Q2251M17