BDBM50123557 CHEMBL3622194
SMILES: CN1CCN(CC1)C(=O)c1ccc2c(c1)[nH]c1c(ccc(-c3cccc(NC(=O)c4ccc(F)cc4)c3)c21)C(N)=O
InChI Key: InChIKey=RBAHQHAFZWLDGS-UHFFFAOYSA-N
Data: 1 IC50
Activity Spreadsheet -- Enzyme Inhibition Constant Data from BindingDB
Found 1 hit for monomerid = 50123557
Trg + Lig
Ki
nM
ΔG°
kcal/mole
IC50
nM
Kd
nM
EC50/IC50
nM
koff
s-1
kon
M-1s-1
pHTemp
°C
Tyrosine-protein kinase BTK
(Homo sapiens (Human))
BDBM50123557
(CHEMBL3622194)
Show SMILES CN1CCN(CC1)C(=O)c1ccc2c(c1)[nH]c1c(ccc(-c3cccc(NC(=O)c4ccc(F)cc4)c3)c21)C(N)=O
Show InChI InChI=1S/C32H28FN5O3/c1-37-13-15-38(16-14-37)32(41)21-7-10-25-27(18-21)36-29-26(30(34)39)12-11-24(28(25)29)20-3-2-4-23(17-20)35-31(40)19-5-8-22(33)9-6-19/h2-12,17-18,36H,13-16H2,1H3,(H2,34,39)(H,35,40)
NCI pathway
Reactome pathway
n/an/a 39n/an/an/an/an/an/a
Bristol-Myers Squibb Pharmaceutical Research Institute
Curated by ChEMBL
Assay Description
Inhibition of human recombinant BTK
Bioorg Med Chem Lett 25: 4265-9 (2015)
BindingDB Entry DOI: 10.7270/Q2251M17