BDBM50123594 (7-Chloro-quinolin-4-yl)-{3-[4-(3-dibutylamino-propyl)-piperazin-1-yl]-propyl}-amine::7-chloro-N-(3-(4-(3-(dibutylamino)propyl)piperazin-1-yl)propyl)quinolin-4-amine::CHEMBL356811
SMILES: CCCCN(CCCC)CCCN1CCN(CCCNc2ccnc3cc(Cl)ccc23)CC1
InChI Key: InChIKey=FVWVRVNTEAFOPI-UHFFFAOYSA-N
Data: 1 IC50
Activity Spreadsheet -- Enzyme Inhibition Constant Data from BindingDB
Found 1 hit for monomerid = 50123594
Trg + Lig
Ki
nM
ΔG°
kcal/mole
IC50
nM
Kd
nM
EC50/IC50
nM
koff
s-1
kon
M-1s-1
pHTemp
°C
Histidine-rich protein
(Plasmodium falciparum)
BDBM50123594
((7-Chloro-quinolin-4-yl)-{3-[4-(3-dibutylamino-pro...)
Show SMILES CCCCN(CCCC)CCCN1CCN(CCCNc2ccnc3cc(Cl)ccc23)CC1
Show InChI InChI=1S/C27H44ClN5/c1-3-5-14-31(15-6-4-2)17-8-18-33-21-19-32(20-22-33)16-7-12-29-26-11-13-30-27-23-24(28)9-10-25(26)27/h9-11,13,23H,3-8,12,14-22H2,1-2H3,(H,29,30)
n/an/a 6.70n/an/an/an/an/an/a
Universit£ de Lille II
Curated by ChEMBL
Assay Description
In vitro inhibition of beta-hematin formation
J Med Chem 46: 542-57 (2003)
Article DOI: 10.1021/jm020960r
BindingDB Entry DOI: 10.7270/Q27W6DDC