BDBM50123672 CHEMBL3622738
SMILES: CCCCCCCCCC(=O)c1c([nH]c2cc(Cl)ccc12)C(=O)OCC
InChI Key: InChIKey=YOLMHIKDOYMMON-UHFFFAOYSA-N
Data: 1 KI  1 IC50
Activity Spreadsheet -- Enzyme Inhibition Constant Data from BindingDB
Found 2 hits for monomerid = 50123672
Trg + Lig
Ki
nM
ΔG°
kcal/mole
IC50
nM
Kd
nM
EC50/IC50
nM
koff
s-1
kon
M-1s-1
pHTemp
°C
Arachidonate 15-lipoxygenase
(Homo sapiens (Human))
BDBM50123672
(CHEMBL3622738)
Show SMILES CCCCCCCCCC(=O)c1c([nH]c2cc(Cl)ccc12)C(=O)OCC
Show InChI InChI=1S/C21H28ClNO3/c1-3-5-6-7-8-9-10-11-18(24)19-16-13-12-15(22)14-17(16)23-20(19)21(25)26-4-2/h12-14,23H,3-11H2,1-2H3
Reactome pathway
80n/an/an/an/an/an/an/an/a
University of Groningen
Curated by ChEMBL
Assay Description
Competitive inhibition of human 15-LOX1 using linoleic acid as substrate after 10 mins by Lineweaver-Burk plot analysis
J Med Chem 58: 7850-62 (2015)
BindingDB Entry DOI: 10.7270/Q28P62BK
Arachidonate 15-lipoxygenase
(Homo sapiens (Human))
BDBM50123672
(CHEMBL3622738)
Show SMILES CCCCCCCCCC(=O)c1c([nH]c2cc(Cl)ccc12)C(=O)OCC
Show InChI InChI=1S/C21H28ClNO3/c1-3-5-6-7-8-9-10-11-18(24)19-16-13-12-15(22)14-17(16)23-20(19)21(25)26-4-2/h12-14,23H,3-11H2,1-2H3
Reactome pathway
n/an/a 200n/an/an/an/an/an/a
University of Groningen
Curated by ChEMBL
Assay Description
Inhibition of human 15-LOX1 assessed as conversion of linoleic acid to 13(S)-HpODE after 10 mins by UV analysis
J Med Chem 58: 7850-62 (2015)
BindingDB Entry DOI: 10.7270/Q28P62BK