BDBM50123911 (4-Chloro-benzoyl)-phenyl-thiocarbamic acid O-phenethyl ester::CHEMBL164496
SMILES: Clc1ccc(cc1)C(=O)N(C(=S)OCCc1ccccc1)c1ccccc1
InChI Key: InChIKey=POXGVFVVCAMNOP-UHFFFAOYSA-N
Data: 1 EC50
Activity Spreadsheet -- Enzyme Inhibition Constant Data from BindingDB
Found 1 hit for monomerid = 50123911
Trg + Lig
Ki
nM
ΔG°
kcal/mole
IC50
nM
Kd
nM
EC50/IC50
nM
koff
s-1
kon
M-1s-1
pHTemp
°C
Human immunodeficiency virus type 1 reverse transcriptase
(Human immunodeficiency virus 1)
BDBM50123911
((4-Chloro-benzoyl)-phenyl-thiocarbamic acid O-phen...)
Show SMILES Clc1ccc(cc1)C(=O)N(C(=S)OCCc1ccccc1)c1ccccc1
Show InChI InChI=1S/C22H18ClNO2S/c23-19-13-11-18(12-14-19)21(25)24(20-9-5-2-6-10-20)22(27)26-16-15-17-7-3-1-4-8-17/h1-14H,15-16H2
n/an/an/an/a 4.00E+3n/an/an/an/a
Università di Genova
Curated by ChEMBL
Assay Description
Concentration required to achieve 50% protection of MT-4 cell from the HIV-1 induced cytopathogenicity was determined by the MTT method
J Med Chem 46: 768-81 (2003)
Article DOI: 10.1021/jm0209984
BindingDB Entry DOI: 10.7270/Q2BC3XXX