BDBM50123917 (4-Fluoro-phenyl)-(thiophene-2-carbonyl)-thiocarbamic acid O-[2-(1,3-dioxo-1,3-dihydro-isoindol-2-yl)-ethyl] ester::CHEMBL164753
SMILES: Fc1ccc(cc1)N(C(=S)OCCN1C(=O)c2ccccc2C1=O)C(=O)c1cccs1
InChI Key: InChIKey=SNJOMTHWQMXLRL-UHFFFAOYSA-N
Data: 1 EC50
Activity Spreadsheet -- Enzyme Inhibition Constant Data from BindingDB
Found 1 hit for monomerid = 50123917
Trg + Lig
Ki
nM
ΔG°
kcal/mole
IC50
nM
Kd
nM
EC50/IC50
nM
koff
s-1
kon
M-1s-1
pHTemp
°C
Human immunodeficiency virus type 1 reverse transcriptase
(Human immunodeficiency virus 1)
BDBM50123917
((4-Fluoro-phenyl)-(thiophene-2-carbonyl)-thiocarba...)
Show SMILES Fc1ccc(cc1)N(C(=S)OCCN1C(=O)c2ccccc2C1=O)C(=O)c1cccs1
Show InChI InChI=1S/C22H15FN2O4S2/c23-14-7-9-15(10-8-14)25(21(28)18-6-3-13-31-18)22(30)29-12-11-24-19(26)16-4-1-2-5-17(16)20(24)27/h1-10,13H,11-12H2
n/an/an/an/a 100n/an/an/an/a
Università di Genova
Curated by ChEMBL
Assay Description
Concentration required to achieve 50% protection of MT-4 cell from the HIV-1 induced cytopathogenicity was determined by the MTT method
J Med Chem 46: 768-81 (2003)
Article DOI: 10.1021/jm0209984
BindingDB Entry DOI: 10.7270/Q2BC3XXX