BDBM50123922 (2-Chloro-pyridine-4-carbonyl)-(4-ethoxy-phenyl)-thiocarbamic acid O-[2-(1,3-dioxo-1,3-dihydro-isoindol-2-yl)-ethyl] ester::CHEMBL165216
SMILES: CCOc1ccc(cc1)N(C(=S)OCCN1C(=O)c2ccccc2C1=O)C(=O)c1ccnc(Cl)c1
InChI Key: InChIKey=BSQSLGNFJPWSCX-UHFFFAOYSA-N
Data: 1 EC50
Activity Spreadsheet -- Enzyme Inhibition Constant Data from BindingDB
Found 1 hit for monomerid = 50123922
Trg + Lig
Ki
nM
ΔG°
kcal/mole
IC50
nM
Kd
nM
EC50/IC50
nM
koff
s-1
kon
M-1s-1
pHTemp
°C
Human immunodeficiency virus type 1 reverse transcriptase
(Human immunodeficiency virus 1)
BDBM50123922
((2-Chloro-pyridine-4-carbonyl)-(4-ethoxy-phenyl)-t...)
Show SMILES CCOc1ccc(cc1)N(C(=S)OCCN1C(=O)c2ccccc2C1=O)C(=O)c1ccnc(Cl)c1
Show InChI InChI=1S/C25H20ClN3O5S/c1-2-33-18-9-7-17(8-10-18)29(22(30)16-11-12-27-21(26)15-16)25(35)34-14-13-28-23(31)19-5-3-4-6-20(19)24(28)32/h3-12,15H,2,13-14H2,1H3
n/an/an/an/a 500n/an/an/an/a
Università di Genova
Curated by ChEMBL
Assay Description
Concentration required to achieve 50% protection of MT-4 cell from the HIV-1 induced cytopathogenicity was determined by the MTT method
J Med Chem 46: 768-81 (2003)
Article DOI: 10.1021/jm0209984
BindingDB Entry DOI: 10.7270/Q2BC3XXX