BDBM50123975 3-[4-(biphenyl-4-sulfonylamino)-phenyl]-N-hydroxy-acrylamide::CHEMBL145891::US8796330, 120
SMILES: ONC(=O)\C=C\c1ccc(NS(=O)(=O)c2ccc(cc2)-c2ccccc2)cc1
InChI Key: InChIKey=CITNMKKLNPYCDV-OVCLIPMQSA-N
Data: 3 IC50  1 EC50
Activity Spreadsheet -- Enzyme Inhibition Constant Data from BindingDB
Found 4 hits for monomerid = 50123975
Trg + Lig
Ki
nM
ΔG°
kcal/mole
IC50
nM
Kd
nM
EC50/IC50
nM
koff
s-1
kon
M-1s-1
pHTemp
°C
Histone deacetylase 1
(Homo sapiens (Human))
BDBM50123975
(3-[4-(biphenyl-4-sulfonylamino)-phenyl]-N-hydroxy-...)
Show SMILES ONC(=O)\C=C\c1ccc(NS(=O)(=O)c2ccc(cc2)-c2ccccc2)cc1
Show InChI InChI=1S/C21H18N2O4S/c24-21(22-25)15-8-16-6-11-19(12-7-16)23-28(26,27)20-13-9-18(10-14-20)17-4-2-1-3-5-17/h1-15,23,25H,(H,22,24)/b15-8+
NCI pathway
Reactome pathway
US Patent
n/an/a 10n/an/an/an/an/a37
Methylgene Inc.
US Patent
Assay Description
For deacetylase assays, 20,000 cpm of the [3H]-metabolically labeled acetylated histone substrate (M. Yoshida et al., J. Biol. Chem. 265(28): 17174-1...
US Patent US8796330 (2014)
BindingDB Entry DOI: 10.7270/Q22B8WQW
Histone deacetylase 1
(Homo sapiens (Human))
BDBM50123975
(3-[4-(biphenyl-4-sulfonylamino)-phenyl]-N-hydroxy-...)
Show SMILES ONC(=O)\C=C\c1ccc(NS(=O)(=O)c2ccc(cc2)-c2ccccc2)cc1
Show InChI InChI=1S/C21H18N2O4S/c24-21(22-25)15-8-16-6-11-19(12-7-16)23-28(26,27)20-13-9-18(10-14-20)17-4-2-1-3-5-17/h1-15,23,25H,(H,22,24)/b15-8+
NCI pathway
Reactome pathway
n/an/a 10n/an/an/an/an/an/a
Aton Pharma, Inc
Curated by ChEMBL
Assay Description
Inhibitory concentration against human Histone deacetylase 1
J Med Chem 46: 5097-116 (2003)
Article DOI: 10.1021/jm0303094
BindingDB Entry DOI: 10.7270/Q2MP5413
Histone deacetylase 4
(Homo sapiens (Human))
BDBM50123975
(3-[4-(biphenyl-4-sulfonylamino)-phenyl]-N-hydroxy-...)
Show SMILES ONC(=O)\C=C\c1ccc(NS(=O)(=O)c2ccc(cc2)-c2ccccc2)cc1
Show InChI InChI=1S/C21H18N2O4S/c24-21(22-25)15-8-16-6-11-19(12-7-16)23-28(26,27)20-13-9-18(10-14-20)17-4-2-1-3-5-17/h1-15,23,25H,(H,22,24)/b15-8+
n/an/an/an/a 1.00E+3n/an/an/an/a
Aton Pharma, Inc
Curated by ChEMBL
Assay Description
Inhibition of acetylation of histone-4 in human T-24 cancer cells
J Med Chem 46: 5097-116 (2003)
Article DOI: 10.1021/jm0303094
BindingDB Entry DOI: 10.7270/Q2MP5413
Histone deacetylase 1
(Homo sapiens (Human))
BDBM50123975
(3-[4-(biphenyl-4-sulfonylamino)-phenyl]-N-hydroxy-...)
Show SMILES ONC(=O)\C=C\c1ccc(NS(=O)(=O)c2ccc(cc2)-c2ccccc2)cc1
Show InChI InChI=1S/C21H18N2O4S/c24-21(22-25)15-8-16-6-11-19(12-7-16)23-28(26,27)20-13-9-18(10-14-20)17-4-2-1-3-5-17/h1-15,23,25H,(H,22,24)/b15-8+
NCI pathway
Reactome pathway
n/an/a 10n/an/an/an/an/an/a
MethylGene Inc.
Curated by ChEMBL
Assay Description
Inhibitory activity on partially purified recombinant human Histone deacetylase 1 (HDAC-1)
J Med Chem 46: 820-30 (2003)
Article DOI: 10.1021/jm020377a
BindingDB Entry DOI: 10.7270/Q22V2FG8