BDBM50124024 2-(4-Chloro-benzenesulfonylamino)-N-[1-formyl-2-(1H-indol-3-yl)-ethyl]-3-methyl-butyramide::CHEMBL169598
SMILES: CC(C)[C@H](NS(=O)(=O)c1ccc(Cl)cc1)C(=O)N[C@H](Cc1c[nH]c2ccccc12)C=O
InChI Key: InChIKey=UVGWXNDNARVPIC-UTKZUKDTSA-N
Data: 1 IC50
Activity Spreadsheet -- Enzyme Inhibition Constant Data from BindingDB
Found 1 hit for monomerid = 50124024
Trg + Lig
Ki
nM
ΔG°
kcal/mole
IC50
nM
Kd
nM
EC50/IC50
nM
koff
s-1
kon
M-1s-1
pHTemp
°C
Calpain1
(Homo sapiens (Human))
BDBM50124024
(2-(4-Chloro-benzenesulfonylamino)-N-[1-formyl-2-(1...)
Show SMILES CC(C)[C@H](NS(=O)(=O)c1ccc(Cl)cc1)C(=O)N[C@H](Cc1c[nH]c2ccccc12)C=O
Show InChI InChI=1S/C22H24ClN3O4S/c1-14(2)21(26-31(29,30)18-9-7-16(23)8-10-18)22(28)25-17(13-27)11-15-12-24-20-6-4-3-5-19(15)20/h3-10,12-14,17,21,24,26H,11H2,1-2H3,(H,25,28)/t17-,21+/m1/s1
Reactome pathway
n/an/a 13n/an/an/an/an/an/a
Senju Pharmaceutical Co.
Curated by ChEMBL
Assay Description
In vitro inhibition of porcine mu-calpain.
J Med Chem 46: 868-71 (2003)
Article DOI: 10.1021/jm0201924
BindingDB Entry DOI: 10.7270/Q2TB168Z