BDBM50124231 2-{[1-((S)-Ethanesulfonyl)-cyclopentanecarbonyl]-amino}-3-(2'-methoxy-biphenyl-4-yl)-propionic acid::CHEMBL171929
SMILES: CCS(=O)(=O)C1(CCCC1)C(=O)N[C@@H](Cc1ccc(cc1)-c1ccccc1OC)C(O)=O
InChI Key: InChIKey=HWTDZVDHOSKTML-FQEVSTJZSA-N
Data: 2 IC50
Activity Spreadsheet -- Enzyme Inhibition Constant Data from BindingDB
Found 2 hits for monomerid = 50124231
Trg + Lig
Ki
nM
ΔG°
kcal/mole
IC50
nM
Kd
nM
EC50/IC50
nM
koff
s-1
kon
M-1s-1
pHTemp
°C
Integrin α4β7
(Homo sapiens (Human))
BDBM50124231
(2-{[1-((S)-Ethanesulfonyl)-cyclopentanecarbonyl]-a...)
Show SMILES CCS(=O)(=O)C1(CCCC1)C(=O)N[C@@H](Cc1ccc(cc1)-c1ccccc1OC)C(O)=O
Show InChI InChI=1S/C24H29NO6S/c1-3-32(29,30)24(14-6-7-15-24)23(28)25-20(22(26)27)16-17-10-12-18(13-11-17)19-8-4-5-9-21(19)31-2/h4-5,8-13,20H,3,6-7,14-16H2,1-2H3,(H,25,28)(H,26,27)/t20-/m0/s1
NCI pathway
Reactome pathway
n/an/a 58n/an/an/an/an/an/a
Merck Research Laboratories
Curated by ChEMBL
Assay Description
Binding affinity towards VLA-4 (alpha4 beta-1) receptor in human Jurkat cells using [125I]VCAM-Ig as radioligand
Bioorg Med Chem Lett 13: 885-90 (2003)
BindingDB Entry DOI: 10.7270/Q2X34WVH
Fibronectin receptor beta/Integrin alpha-4
(Homo sapiens (Human))
BDBM50124231
(2-{[1-((S)-Ethanesulfonyl)-cyclopentanecarbonyl]-a...)
Show SMILES CCS(=O)(=O)C1(CCCC1)C(=O)N[C@@H](Cc1ccc(cc1)-c1ccccc1OC)C(O)=O
Show InChI InChI=1S/C24H29NO6S/c1-3-32(29,30)24(14-6-7-15-24)23(28)25-20(22(26)27)16-17-10-12-18(13-11-17)19-8-4-5-9-21(19)31-2/h4-5,8-13,20H,3,6-7,14-16H2,1-2H3,(H,25,28)(H,26,27)/t20-/m0/s1
Reactome pathway
n/an/a 0.530n/an/an/an/an/an/a
Merck Research Laboratories
Curated by ChEMBL
Assay Description
Binding affinity towards VLA-4 (alpha4 beta-1) receptor in human Jurkat cells using [125I]VCAM-Ig as radioligand
Bioorg Med Chem Lett 13: 885-90 (2003)
BindingDB Entry DOI: 10.7270/Q2X34WVH