BDBM50124243 2-{[4-((S)-Benzenesulfonyl)-1-oxo-hexahydro-1lambda*4*-thiopyran-4-carbonyl]-amino}-3-(2'-methoxy-biphenyl-4-yl)-propionic acid::CHEMBL167949
SMILES: COc1ccccc1-c1ccc(C[C@H](NC(=O)C2(CCS(=O)CC2)S(=O)(=O)c2ccccc2)C(O)=O)cc1
InChI Key: InChIKey=TXTKZSBIOMEMHC-UGUNWOKGSA-N
Data: 2 IC50
Activity Spreadsheet -- Enzyme Inhibition Constant Data from BindingDB
Found 2 hits for monomerid = 50124243
Trg + Lig
Ki
nM
ΔG°
kcal/mole
IC50
nM
Kd
nM
EC50/IC50
nM
koff
s-1
kon
M-1s-1
pHTemp
°C
Fibronectin receptor beta/Integrin alpha-4
(Homo sapiens (Human))
BDBM50124243
(2-{[4-((S)-Benzenesulfonyl)-1-oxo-hexahydro-1lambd...)
Show SMILES COc1ccccc1-c1ccc(C[C@H](NC(=O)C2(CCS(=O)CC2)S(=O)(=O)c2ccccc2)C(O)=O)cc1
Show InChI InChI=1S/C28H29NO7S2/c1-36-25-10-6-5-9-23(25)21-13-11-20(12-14-21)19-24(26(30)31)29-27(32)28(15-17-37(33)18-16-28)38(34,35)22-7-3-2-4-8-22/h2-14,24H,15-19H2,1H3,(H,29,32)(H,30,31)/t24-,28?,37?/m0/s1
Reactome pathway
n/an/a 4.40n/an/an/an/an/an/a
Merck Research Laboratories
Curated by ChEMBL
Assay Description
Binding affinity towards VLA-4 (alpha4 beta-1) receptor in human Jurkat cells using [125I]VCAM-Ig as radioligand
Bioorg Med Chem Lett 13: 885-90 (2003)
BindingDB Entry DOI: 10.7270/Q2X34WVH
Integrin α4β7
(Homo sapiens (Human))
BDBM50124243
(2-{[4-((S)-Benzenesulfonyl)-1-oxo-hexahydro-1lambd...)
Show SMILES COc1ccccc1-c1ccc(C[C@H](NC(=O)C2(CCS(=O)CC2)S(=O)(=O)c2ccccc2)C(O)=O)cc1
Show InChI InChI=1S/C28H29NO7S2/c1-36-25-10-6-5-9-23(25)21-13-11-20(12-14-21)19-24(26(30)31)29-27(32)28(15-17-37(33)18-16-28)38(34,35)22-7-3-2-4-8-22/h2-14,24H,15-19H2,1H3,(H,29,32)(H,30,31)/t24-,28?,37?/m0/s1
NCI pathway
Reactome pathway
n/an/a 318n/an/an/an/an/an/a
Merck Research Laboratories
Curated by ChEMBL
Assay Description
Binding affinity towards VLA-4 (alpha4 beta7) receptor in human RPMI-8866 B-cell line using [125I]MAdCAM-Ig as radioligand
Bioorg Med Chem Lett 13: 885-90 (2003)
BindingDB Entry DOI: 10.7270/Q2X34WVH