BDBM50124246 3-(2',6'-Dimethoxy-biphenyl-4-yl)-2-{[3-((S)-3-methyl-3H-imidazole-4-sulfonyl)-piperidine-3-carbonyl]-amino}-propionic acid::CHEMBL169444
SMILES: COc1cccc(OC)c1-c1ccc(C[C@H](NC(=O)C2(CCCNC2)S(=O)(=O)c2cncn2C)C(O)=O)cc1
InChI Key: InChIKey=MCAIXYIMLUUTHW-SVQMELKDSA-N
Data: 2 IC50
Activity Spreadsheet -- Enzyme Inhibition Constant Data from BindingDB
Found 2 hits for monomerid = 50124246
Trg + Lig
Ki
nM
ΔG°
kcal/mole
IC50
nM
Kd
nM
EC50/IC50
nM
koff
s-1
kon
M-1s-1
pHTemp
°C
Integrin α4β7
(Homo sapiens (Human))
BDBM50124246
(3-(2',6'-Dimethoxy-biphenyl-4-yl)-2-{[3-((S)-3-met...)
Show SMILES COc1cccc(OC)c1-c1ccc(C[C@H](NC(=O)C2(CCCNC2)S(=O)(=O)c2cncn2C)C(O)=O)cc1
Show InChI InChI=1S/C27H32N4O7S/c1-31-17-29-15-23(31)39(35,36)27(12-5-13-28-16-27)26(34)30-20(25(32)33)14-18-8-10-19(11-9-18)24-21(37-2)6-4-7-22(24)38-3/h4,6-11,15,17,20,28H,5,12-14,16H2,1-3H3,(H,30,34)(H,32,33)/t20-,27?/m0/s1
NCI pathway
Reactome pathway
n/an/a 46n/an/an/an/an/an/a
Merck Research Laboratories
Curated by ChEMBL
Assay Description
Binding affinity towards VLA-4 (alpha4 beta7) receptor in human RPMI-8866 B-cell line using [125I]MAdCAM-Ig as radioligand
Bioorg Med Chem Lett 13: 885-90 (2003)
BindingDB Entry DOI: 10.7270/Q2X34WVH
Fibronectin receptor beta/Integrin alpha-4
(Homo sapiens (Human))
BDBM50124246
(3-(2',6'-Dimethoxy-biphenyl-4-yl)-2-{[3-((S)-3-met...)
Show SMILES COc1cccc(OC)c1-c1ccc(C[C@H](NC(=O)C2(CCCNC2)S(=O)(=O)c2cncn2C)C(O)=O)cc1
Show InChI InChI=1S/C27H32N4O7S/c1-31-17-29-15-23(31)39(35,36)27(12-5-13-28-16-27)26(34)30-20(25(32)33)14-18-8-10-19(11-9-18)24-21(37-2)6-4-7-22(24)38-3/h4,6-11,15,17,20,28H,5,12-14,16H2,1-3H3,(H,30,34)(H,32,33)/t20-,27?/m0/s1
Reactome pathway
n/an/a 0.140n/an/an/an/an/an/a
Merck Research Laboratories
Curated by ChEMBL
Assay Description
Binding affinity towards VLA-4 (alpha4 beta7) receptor in human RPMI-8866 B-cell line using [125I]MAdCAM-Ig as radioligand
Bioorg Med Chem Lett 13: 885-90 (2003)
BindingDB Entry DOI: 10.7270/Q2X34WVH