BDBM50124611 (5-Allyl-2,2,4-trimethyl-2,5-dihydro-1H-6-oxa-1-aza-chrysen-10-yl)-methyl-amine::CHEMBL440454
SMILES: CNc1cccc2OC(CC=C)c3c(ccc4NC(C)(C)C=C(C)c34)-c12
InChI Key: InChIKey=FTXXHRFFVNCHHO-UHFFFAOYSA-N
Data: 3 KI  4 EC50
Activity Spreadsheet -- Enzyme Inhibition Constant Data from BindingDB
Found 7 hits for monomerid = 50124611
Trg + Lig
Ki
nM
ΔG°
kcal/mole
IC50
nM
Kd
nM
EC50/IC50
nM
koff
s-1
kon
M-1s-1
pHTemp
°C
Glucocorticoid receptor
(Homo sapiens (Human))
BDBM50124611
((5-Allyl-2,2,4-trimethyl-2,5-dihydro-1H-6-oxa-1-az...)
Show SMILES CNc1cccc2OC(CC=C)c3c(ccc4NC(C)(C)C=C(C)c34)-c12 |t:21|
Show InChI InChI=1S/C23H26N2O/c1-6-8-18-22-15(21-16(24-5)9-7-10-19(21)26-18)11-12-17-20(22)14(2)13-23(3,4)25-17/h6-7,9-13,18,24-25H,1,8H2,2-5H3
7n/an/an/an/an/an/an/an/a
Abbott Laboratories
Curated by ChEMBL
Assay Description
Binding affinity towards human glucocorticoid receptor (GR) was determined using [3H]-Dexamethasone as radioligand in SF-1 cells
J Med Chem 46: 1016-30 (2003)
Article DOI: 10.1021/jm020335m
BindingDB Entry DOI: 10.7270/Q2MP52NB
Androgen Receptor
(Homo sapiens (Human))
BDBM50124611
((5-Allyl-2,2,4-trimethyl-2,5-dihydro-1H-6-oxa-1-az...)
Show SMILES CNc1cccc2OC(CC=C)c3c(ccc4NC(C)(C)C=C(C)c34)-c12 |t:21|
Show InChI InChI=1S/C23H26N2O/c1-6-8-18-22-15(21-16(24-5)9-7-10-19(21)26-18)11-12-17-20(22)14(2)13-23(3,4)25-17/h6-7,9-13,18,24-25H,1,8H2,2-5H3
NCI pathway
Reactome pathway
2.59E+3n/an/an/an/an/an/an/an/a
Abbott Laboratories
Curated by ChEMBL
Assay Description
Binding affinity towards testosterone receptor
J Med Chem 46: 1016-30 (2003)
Article DOI: 10.1021/jm020335m
BindingDB Entry DOI: 10.7270/Q2MP52NB
Progesterone receptor
(Homo sapiens (Human))
BDBM50124611
((5-Allyl-2,2,4-trimethyl-2,5-dihydro-1H-6-oxa-1-az...)
Show SMILES CNc1cccc2OC(CC=C)c3c(ccc4NC(C)(C)C=C(C)c34)-c12 |t:21|
Show InChI InChI=1S/C23H26N2O/c1-6-8-18-22-15(21-16(24-5)9-7-10-19(21)26-18)11-12-17-20(22)14(2)13-23(3,4)25-17/h6-7,9-13,18,24-25H,1,8H2,2-5H3
2.92E+3n/an/an/an/an/an/an/an/a
Abbott Laboratories
Curated by ChEMBL
Assay Description
Displacement of [3H]-progesterone from human Progesterone receptor A
J Med Chem 46: 1016-30 (2003)
Article DOI: 10.1021/jm020335m
BindingDB Entry DOI: 10.7270/Q2MP52NB
Glucocorticoid receptor
(Homo sapiens (Human))
BDBM50124611
((5-Allyl-2,2,4-trimethyl-2,5-dihydro-1H-6-oxa-1-az...)
Show SMILES CNc1cccc2OC(CC=C)c3c(ccc4NC(C)(C)C=C(C)c34)-c12 |t:21|
Show InChI InChI=1S/C23H26N2O/c1-6-8-18-22-15(21-16(24-5)9-7-10-19(21)26-18)11-12-17-20(22)14(2)13-23(3,4)25-17/h6-7,9-13,18,24-25H,1,8H2,2-5H3
n/an/an/an/a 19n/an/an/an/a
Abbott Laboratories
Curated by ChEMBL
Assay Description
Transcriptional repression in HepG2 cells expressing human glucocorticoid receptor
J Med Chem 46: 1016-30 (2003)
Article DOI: 10.1021/jm020335m
BindingDB Entry DOI: 10.7270/Q2MP52NB
Glucocorticoid
(RAT)
BDBM50124611
((5-Allyl-2,2,4-trimethyl-2,5-dihydro-1H-6-oxa-1-az...)
Show SMILES CNc1cccc2OC(CC=C)c3c(ccc4NC(C)(C)C=C(C)c34)-c12 |t:21|
Show InChI InChI=1S/C23H26N2O/c1-6-8-18-22-15(21-16(24-5)9-7-10-19(21)26-18)11-12-17-20(22)14(2)13-23(3,4)25-17/h6-7,9-13,18,24-25H,1,8H2,2-5H3
n/an/an/an/a 48n/an/an/an/a
Abbott Laboratories
Curated by ChEMBL
Assay Description
Inhibition of conconavalin A stimulated rat splenocyte proliferation
J Med Chem 46: 1016-30 (2003)
Article DOI: 10.1021/jm020335m
BindingDB Entry DOI: 10.7270/Q2MP52NB
Glucocorticoid receptor
(Homo sapiens (Human))
BDBM50124611
((5-Allyl-2,2,4-trimethyl-2,5-dihydro-1H-6-oxa-1-az...)
Show SMILES CNc1cccc2OC(CC=C)c3c(ccc4NC(C)(C)C=C(C)c34)-c12 |t:21|
Show InChI InChI=1S/C23H26N2O/c1-6-8-18-22-15(21-16(24-5)9-7-10-19(21)26-18)11-12-17-20(22)14(2)13-23(3,4)25-17/h6-7,9-13,18,24-25H,1,8H2,2-5H3
n/an/an/an/a 418n/an/an/an/a
Abbott Laboratories
Curated by ChEMBL
Assay Description
Transcriptional repression in HepG2 cells expressing human glucocorticoid receptor
J Med Chem 46: 1016-30 (2003)
Article DOI: 10.1021/jm020335m
BindingDB Entry DOI: 10.7270/Q2MP52NB
Glucocorticoid receptor
(Homo sapiens (Human))
BDBM50124611
((5-Allyl-2,2,4-trimethyl-2,5-dihydro-1H-6-oxa-1-az...)
Show SMILES CNc1cccc2OC(CC=C)c3c(ccc4NC(C)(C)C=C(C)c34)-c12 |t:21|
Show InChI InChI=1S/C23H26N2O/c1-6-8-18-22-15(21-16(24-5)9-7-10-19(21)26-18)11-12-17-20(22)14(2)13-23(3,4)25-17/h6-7,9-13,18,24-25H,1,8H2,2-5H3
n/an/an/an/a 32n/an/an/an/a
Abbott Laboratories
Curated by ChEMBL
Assay Description
Transcriptional repression in HepG2 cells expressing human glucocorticoid receptor
J Med Chem 46: 1016-30 (2003)
Article DOI: 10.1021/jm020335m
BindingDB Entry DOI: 10.7270/Q2MP52NB