null
SMILES: COc1ccc2OC(CC=C)c3c(ccc4NC(C)(C)C=C(C)c34)-c2c1OC
InChI Key: InChIKey=RLNRYNADPTVFSB-UHFFFAOYSA-N
Activity Spreadsheet -- Enzyme Inhibition Constant Data from BindingDB
Found 3 hits for monomerid = 50124613
Trg + Lig
Ki
nM
ΔG°
kcal/mole
IC50
nM
Kd
nM
EC50/IC50
nM
koff
s-1
kon
M-1s-1
pHTemp
°C
Glucocorticoid receptor
(Homo sapiens (Human))
BDBM50124613
(5-Allyl-9,10-dimethoxy-2,2,4-trimethyl-2,5-dihydro...)
Show SMILES COc1ccc2OC(CC=C)c3c(ccc4NC(C)(C)C=C(C)c34)-c2c1OC |t:20|
Show InChI InChI=1S/C24H27NO3/c1-7-8-17-21-15(9-10-16-20(21)14(2)13-24(3,4)25-16)22-18(28-17)11-12-19(26-5)23(22)27-6/h7,9-13,17,25H,1,8H2,2-6H3
12n/an/an/an/an/an/an/an/a
Abbott Laboratories
Curated by ChEMBL
Assay Description
Binding affinity towards human glucocorticoid receptor (GR) was determined using [3H]-Dexamethasone as radioligand in SF-1 cells
J Med Chem 46: 1016-30 (2003)
Article DOI: 10.1021/jm020335m
BindingDB Entry DOI: 10.7270/Q2MP52NB
Progesterone receptor
(Homo sapiens (Human))
BDBM50124613
(5-Allyl-9,10-dimethoxy-2,2,4-trimethyl-2,5-dihydro...)
Show SMILES COc1ccc2OC(CC=C)c3c(ccc4NC(C)(C)C=C(C)c34)-c2c1OC |t:20|
Show InChI InChI=1S/C24H27NO3/c1-7-8-17-21-15(9-10-16-20(21)14(2)13-24(3,4)25-16)22-18(28-17)11-12-19(26-5)23(22)27-6/h7,9-13,17,25H,1,8H2,2-6H3
610n/an/an/an/an/an/an/an/a
Abbott Laboratories
Curated by ChEMBL
Assay Description
Displacement of [3H]-progesterone from human Progesterone receptor A
J Med Chem 46: 1016-30 (2003)
Article DOI: 10.1021/jm020335m
BindingDB Entry DOI: 10.7270/Q2MP52NB
Glucocorticoid receptor
(Homo sapiens (Human))
BDBM50124613
(5-Allyl-9,10-dimethoxy-2,2,4-trimethyl-2,5-dihydro...)
Show SMILES COc1ccc2OC(CC=C)c3c(ccc4NC(C)(C)C=C(C)c34)-c2c1OC |t:20|
Show InChI InChI=1S/C24H27NO3/c1-7-8-17-21-15(9-10-16-20(21)14(2)13-24(3,4)25-16)22-18(28-17)11-12-19(26-5)23(22)27-6/h7,9-13,17,25H,1,8H2,2-6H3
n/an/an/an/a 120n/an/an/an/a
Abbott Laboratories
Curated by ChEMBL
Assay Description
Inhibition of dihydrofolate reductase DHFR in Pneumocystis carinii.
J Med Chem 46: 1016-30 (2003)
Article DOI: 10.1021/jm020335m
BindingDB Entry DOI: 10.7270/Q2MP52NB