null
SMILES: COc1c(Br)ccc2OC(CC=C)c3c(ccc4NC(C)(C)C=C(C)c34)-c12
InChI Key: InChIKey=MIPUTBSSNQTOCB-UHFFFAOYSA-N
Activity Spreadsheet -- Enzyme Inhibition Constant Data from BindingDB
Found 3 hits for monomerid = 50124620
Trg + Lig
Ki
nM
ΔG°
kcal/mole
IC50
nM
Kd
nM
EC50/IC50
nM
koff
s-1
kon
M-1s-1
pHTemp
°C
Glucocorticoid receptor
(Homo sapiens (Human))
BDBM50124620
(5-Allyl-9-bromo-10-methoxy-2,2,4-trimethyl-2,5-dih...)
Show SMILES COc1c(Br)ccc2OC(CC=C)c3c(ccc4NC(C)(C)C=C(C)c34)-c12 |t:22|
Show InChI InChI=1S/C23H24BrNO2/c1-6-7-17-20-14(21-18(27-17)11-9-15(24)22(21)26-5)8-10-16-19(20)13(2)12-23(3,4)25-16/h6,8-12,17,25H,1,7H2,2-5H3
5.30n/an/an/an/an/an/an/an/a
Abbott Laboratories
Curated by ChEMBL
Assay Description
Binding affinity towards human glucocorticoid receptor (GR) was determined using [3H]-Dexamethasone as radioligand in SF-1 cells
J Med Chem 46: 1016-30 (2003)
Article DOI: 10.1021/jm020335m
BindingDB Entry DOI: 10.7270/Q2MP52NB
Progesterone receptor
(Homo sapiens (Human))
BDBM50124620
(5-Allyl-9-bromo-10-methoxy-2,2,4-trimethyl-2,5-dih...)
Show SMILES COc1c(Br)ccc2OC(CC=C)c3c(ccc4NC(C)(C)C=C(C)c34)-c12 |t:22|
Show InChI InChI=1S/C23H24BrNO2/c1-6-7-17-20-14(21-18(27-17)11-9-15(24)22(21)26-5)8-10-16-19(20)13(2)12-23(3,4)25-16/h6,8-12,17,25H,1,7H2,2-5H3
34n/an/an/an/an/an/an/an/a
Abbott Laboratories
Curated by ChEMBL
Assay Description
Displacement of [3H]-progesterone from human Progesterone receptor A
J Med Chem 46: 1016-30 (2003)
Article DOI: 10.1021/jm020335m
BindingDB Entry DOI: 10.7270/Q2MP52NB
Glucocorticoid receptor
(Homo sapiens (Human))
BDBM50124620
(5-Allyl-9-bromo-10-methoxy-2,2,4-trimethyl-2,5-dih...)
Show SMILES COc1c(Br)ccc2OC(CC=C)c3c(ccc4NC(C)(C)C=C(C)c34)-c12 |t:22|
Show InChI InChI=1S/C23H24BrNO2/c1-6-7-17-20-14(21-18(27-17)11-9-15(24)22(21)26-5)8-10-16-19(20)13(2)12-23(3,4)25-16/h6,8-12,17,25H,1,7H2,2-5H3
n/an/an/an/a 82n/an/an/an/a
Abbott Laboratories
Curated by ChEMBL
Assay Description
Binding affinity towards aldosterone receptor (Mineralocorticoid receptor)
J Med Chem 46: 1016-30 (2003)
Article DOI: 10.1021/jm020335m
BindingDB Entry DOI: 10.7270/Q2MP52NB