BDBM50124850 2-[3-(5-Bromo-2-ethoxy-3-methyl-benzylamino)-propylamino]-1H-quinolin-4-one::CHEMBL422699
SMILES: CCOc1c(C)cc(Br)cc1CNCCCNc1cc(O)c2ccccc2n1
InChI Key: InChIKey=OVUDXTNLEILHLP-UHFFFAOYSA-N
Data: 1 IC50
Activity Spreadsheet -- Enzyme Inhibition Constant Data from BindingDB
Found 1 hit for monomerid = 50124850
Trg + Lig
Ki
nM
ΔG°
kcal/mole
IC50
nM
Kd
nM
EC50/IC50
nM
koff
s-1
kon
M-1s-1
pHTemp
°C
Methionyl-tRNA synthetase
(Escherichia coli (strain K12))
BDBM50124850
(2-[3-(5-Bromo-2-ethoxy-3-methyl-benzylamino)-propy...)
Show SMILES CCOc1c(C)cc(Br)cc1CNCCCNc1cc(O)c2ccccc2n1
Show InChI InChI=1S/C22H26BrN3O2/c1-3-28-22-15(2)11-17(23)12-16(22)14-24-9-6-10-25-21-13-20(27)18-7-4-5-8-19(18)26-21/h4-5,7-8,11-13,24H,3,6,9-10,14H2,1-2H3,(H2,25,26,27)
n/an/a 5.70n/an/an/an/an/an/a
GlaxoSmithKline
Curated by ChEMBL
Assay Description
Compound tested for inhibition of Staphylococcus aureus MRS (methionyl tRNA synthetase) in aminoacylation assay
Bioorg Med Chem Lett 13: 665-8 (2003)
BindingDB Entry DOI: 10.7270/Q2KP81JD