BDBM50124889 CHEMBL3623559
SMILES: FC(F)C(=O)c1cnn(c1)C1CCCC1
InChI Key: InChIKey=LCJHAMFHXGMYLX-UHFFFAOYSA-N
Data: 4 IC50
Activity Spreadsheet -- Enzyme Inhibition Constant Data from BindingDB
Found 4 hits for monomerid = 50124889
Trg + Lig
Ki
nM
ΔG°
kcal/mole
IC50
nM
Kd
nM
EC50/IC50
nM
koff
s-1
kon
M-1s-1
pHTemp
°C
Acetylcholinesterase
(Homo sapiens (Human))
BDBM50124889
(CHEMBL3623559)
Show SMILES FC(F)C(=O)c1cnn(c1)C1CCCC1
Show InChI InChI=1S/C10H12F2N2O/c11-10(12)9(15)7-5-13-14(6-7)8-3-1-2-4-8/h5-6,8,10H,1-4H2
NCI pathway
Reactome pathway
n/an/a 208n/an/an/an/an/an/a
Virginia Tech
Curated by ChEMBL
Assay Description
Inhibition of recombinant human AChE after 10 mins by Ellman assay
Bioorg Med Chem Lett 25: 4405-11 (2015)
BindingDB Entry DOI: 10.7270/Q2Z60QV8
Acetylcholinesterase
(Anopheles gambiae)
BDBM50124889
(CHEMBL3623559)
Show SMILES FC(F)C(=O)c1cnn(c1)C1CCCC1
Show InChI InChI=1S/C10H12F2N2O/c11-10(12)9(15)7-5-13-14(6-7)8-3-1-2-4-8/h5-6,8,10H,1-4H2
n/an/a 106n/an/an/an/an/an/a
Virginia Tech
Curated by ChEMBL
Assay Description
Inhibition of recombinant Anopheles gambiae wild type AChE after 10 mins by Ellman assay
Bioorg Med Chem Lett 25: 4405-11 (2015)
BindingDB Entry DOI: 10.7270/Q2Z60QV8
Acetylcholinesterase
(Anopheles gambiae)
BDBM50124889
(CHEMBL3623559)
Show SMILES FC(F)C(=O)c1cnn(c1)C1CCCC1
Show InChI InChI=1S/C10H12F2N2O/c11-10(12)9(15)7-5-13-14(6-7)8-3-1-2-4-8/h5-6,8,10H,1-4H2
n/an/a 134n/an/an/an/an/an/a
Virginia Tech
Curated by ChEMBL
Assay Description
Inhibition of recombinant Anopheles gambiae wild type AChE after 60 mins by Ellman assay
Bioorg Med Chem Lett 25: 4405-11 (2015)
BindingDB Entry DOI: 10.7270/Q2Z60QV8
Acetylcholinesterase
(Homo sapiens (Human))
BDBM50124889
(CHEMBL3623559)
Show SMILES FC(F)C(=O)c1cnn(c1)C1CCCC1
Show InChI InChI=1S/C10H12F2N2O/c11-10(12)9(15)7-5-13-14(6-7)8-3-1-2-4-8/h5-6,8,10H,1-4H2
NCI pathway
Reactome pathway
n/an/a 244n/an/an/an/an/an/a
Virginia Tech
Curated by ChEMBL
Assay Description
Inhibition of recombinant human AChE after 60 mins by Ellman assay
Bioorg Med Chem Lett 25: 4405-11 (2015)
BindingDB Entry DOI: 10.7270/Q2Z60QV8