null
SMILES: [O-][N+](=O)c1cccc(NC(=O)c2ccc3OCOc3c2)c1
InChI Key: InChIKey=NRAPTJKMEMMXTF-UHFFFAOYSA-N
Activity Spreadsheet -- Enzyme Inhibition Constant Data from BindingDB
Found 1 hit for monomerid = 50124899
Trg + Lig
Ki
nM
ΔG°
kcal/mole
IC50
nM
Kd
nM
EC50/IC50
nM
koff
s-1
kon
M-1s-1
pHTemp
°C
Histone-lysine N-methyltransferase SETD7
(Homo sapiens (Human))
BDBM50124899
(CHEMBL1577117)
Show SMILES [O-][N+](=O)c1cccc(NC(=O)c2ccc3OCOc3c2)c1
Show InChI InChI=1S/C14H10N2O5/c17-14(9-4-5-12-13(6-9)21-8-20-12)15-10-2-1-3-11(7-10)16(18)19/h1-7H,8H2,(H,15,17)
n/an/a 6.18E+4n/an/an/an/an/an/a
Shanghai University
Curated by ChEMBL
Assay Description
Competitive inhibition of SET7 (unknown origin) after 60 mins by AlphaLISA method in presence of SAM
J Med Chem 58: 8166-81 (2015)
BindingDB Entry DOI: 10.7270/Q2TF005S