null
SMILES: CN(c1ccccc1)c1ccc(cn1)C(Cc1cc[n+]([O-])cc1)c1ccc(OC(F)F)c(OC(F)F)c1
InChI Key: InChIKey=CDQYZMDHFPVYTD-UHFFFAOYSA-N
Activity Spreadsheet -- Enzyme Inhibition Constant Data from BindingDB
Found 1 hit for monomerid = 50125062
Trg + Lig
Ki
nM
ΔG°
kcal/mole
IC50
nM
Kd
nM
EC50/IC50
nM
koff
s-1
kon
M-1s-1
pHTemp
°C
cAMP-specific 3',5'-cyclic phosphodiesterase 4A
(Homo sapiens (Human))
BDBM50125062
(CHEMBL162485 | {5-[1-(3,4-Bis-difluoromethoxy-phen...)
Show SMILES CN(c1ccccc1)c1ccc(cn1)C(Cc1cc[n+]([O-])cc1)c1ccc(OC(F)F)c(OC(F)F)c1
Show InChI InChI=1S/C27H23F4N3O3/c1-33(21-5-3-2-4-6-21)25-10-8-20(17-32-25)22(15-18-11-13-34(35)14-12-18)19-7-9-23(36-26(28)29)24(16-19)37-27(30)31/h2-14,16-17,22,26-27H,15H2,1H3
n/an/a 0.800n/an/an/an/an/an/a
Merck Frosst Centre for Therapeutic Research
Curated by ChEMBL
Assay Description
Inhibitory activity against human PDE4A expressed isoform using construct representing the common region of spliced variants as GST-fusion protein in...
Bioorg Med Chem Lett 13: 741-4 (2003)
BindingDB Entry DOI: 10.7270/Q2PG1R3G