null
SMILES: [O-][n+]1ccc(CC(c2ccc(NCc3ccccc3)nc2)c2ccc(OC(F)F)c(OC(F)F)c2)cc1
InChI Key: InChIKey=CBGQPZWENDUDMW-UHFFFAOYSA-N
Activity Spreadsheet -- Enzyme Inhibition Constant Data from BindingDB
Found 1 hit for monomerid = 50125063
Trg + Lig
Ki
nM
ΔG°
kcal/mole
IC50
nM
Kd
nM
EC50/IC50
nM
koff
s-1
kon
M-1s-1
pHTemp
°C
cAMP-specific 3',5'-cyclic phosphodiesterase 4A
(Homo sapiens (Human))
BDBM50125063
(Benzyl-{5-[1-(3,4-bis-difluoromethoxy-phenyl)-2-(1...)
Show SMILES [O-][n+]1ccc(CC(c2ccc(NCc3ccccc3)nc2)c2ccc(OC(F)F)c(OC(F)F)c2)cc1
Show InChI InChI=1S/C27H23F4N3O3/c28-26(29)36-23-8-6-20(15-24(23)37-27(30)31)22(14-18-10-12-34(35)13-11-18)21-7-9-25(33-17-21)32-16-19-4-2-1-3-5-19/h1-13,15,17,22,26-27H,14,16H2,(H,32,33)
n/an/a 1.20n/an/an/an/an/an/a
Merck Frosst Centre for Therapeutic Research
Curated by ChEMBL
Assay Description
Inhibitory activity against human PDE4A expressed isoform using construct representing the common region of spliced variants as GST-fusion protein in...
Bioorg Med Chem Lett 13: 741-4 (2003)
BindingDB Entry DOI: 10.7270/Q2PG1R3G