null
SMILES: CN(Cc1ccccc1)c1ccc(cn1)C(Cc1cc[n+]([O-])cc1)c1ccc(OC(F)F)c(OC(F)F)c1
InChI Key: InChIKey=PYMWHQDWPKXMFS-UHFFFAOYSA-N
Activity Spreadsheet -- Enzyme Inhibition Constant Data from BindingDB
Found 1 hit for monomerid = 50125064
Trg + Lig
Ki
nM
ΔG°
kcal/mole
IC50
nM
Kd
nM
EC50/IC50
nM
koff
s-1
kon
M-1s-1
pHTemp
°C
cAMP-specific 3',5'-cyclic phosphodiesterase 4A
(Homo sapiens (Human))
BDBM50125064
(Benzyl-{5-[1-(3,4-bis-difluoromethoxy-phenyl)-2-(1...)
Show SMILES CN(Cc1ccccc1)c1ccc(cn1)C(Cc1cc[n+]([O-])cc1)c1ccc(OC(F)F)c(OC(F)F)c1
Show InChI InChI=1S/C28H25F4N3O3/c1-34(18-20-5-3-2-4-6-20)26-10-8-22(17-33-26)23(15-19-11-13-35(36)14-12-19)21-7-9-24(37-27(29)30)25(16-21)38-28(31)32/h2-14,16-17,23,27-28H,15,18H2,1H3
n/an/a 1.20n/an/an/an/an/an/a
Merck Frosst Centre for Therapeutic Research
Curated by ChEMBL
Assay Description
Inhibitory activity against human PDE4A expressed isoform using construct representing the common region of spliced variants as GST-fusion protein in...
Bioorg Med Chem Lett 13: 741-4 (2003)
BindingDB Entry DOI: 10.7270/Q2PG1R3G