BDBM50125974 CHEMBL3627895::US10189819, Example 46
SMILES: Cc1ncn(n1)-c1cc(Cl)c(C(=O)NC[C@H](c2nc3ccc(Cl)cc3[nH]2)c2cccc(F)c2)c(Cl)c1
InChI Key: InChIKey=FOHVKOZKLHOUOO-SFHVURJKSA-N
Data: 2 KI  6 IC50
Activity Spreadsheet -- Enzyme Inhibition Constant Data from BindingDB
Found 8 hits for monomerid = 50125974
Trg + Lig
Ki
nM
ΔG°
kcal/mole
IC50
nM
Kd
nM
EC50/IC50
nM
koff
s-1
kon
M-1s-1
pHTemp
°C
Coagulation factor IX
(Homo sapiens (Human))
BDBM50125974
(CHEMBL3627895 | US10189819, Example 46)
Show SMILES Cc1ncn(n1)-c1cc(Cl)c(C(=O)NC[C@H](c2nc3ccc(Cl)cc3[nH]2)c2cccc(F)c2)c(Cl)c1 |r|
Show InChI InChI=1S/C25H18Cl3FN6O/c1-13-31-12-35(34-13)17-9-19(27)23(20(28)10-17)25(36)30-11-18(14-3-2-4-16(29)7-14)24-32-21-6-5-15(26)8-22(21)33-24/h2-10,12,18H,11H2,1H3,(H,30,36)(H,32,33)/t18-/m0/s1
Reactome pathway
9.80n/an/an/an/an/an/an/an/a
Merck Research Laboratories
Curated by ChEMBL
Assay Description
Inhibition of human coagulation factor 9a using fluorescent peptide CH3SO2-D-CHG-Gly-Arg-AFC-AcoH as substrate
Bioorg Med Chem Lett 25: 4945-9 (2015)
BindingDB Entry DOI: 10.7270/Q20Z753B
Coagulation factor X
(Homo sapiens (Human))
BDBM50125974
(CHEMBL3627895 | US10189819, Example 46)
Show SMILES Cc1ncn(n1)-c1cc(Cl)c(C(=O)NC[C@H](c2nc3ccc(Cl)cc3[nH]2)c2cccc(F)c2)c(Cl)c1 |r|
Show InChI InChI=1S/C25H18Cl3FN6O/c1-13-31-12-35(34-13)17-9-19(27)23(20(28)10-17)25(36)30-11-18(14-3-2-4-16(29)7-14)24-32-21-6-5-15(26)8-22(21)33-24/h2-10,12,18H,11H2,1H3,(H,30,36)(H,32,33)/t18-/m0/s1
Reactome pathway
2.07E+4n/an/an/an/an/an/an/an/a
Merck Research Laboratories
Curated by ChEMBL
Assay Description
Inhibition of human coagulation factor 10a using fluorescent peptide nAcetyl-KPR-AFC as substrate
Bioorg Med Chem Lett 25: 4945-9 (2015)
BindingDB Entry DOI: 10.7270/Q20Z753B
Potassium voltage-gated channel subfamily H member 2
(Homo sapiens (Human))
BDBM50125974
(CHEMBL3627895 | US10189819, Example 46)
Show SMILES Cc1ncn(n1)-c1cc(Cl)c(C(=O)NC[C@H](c2nc3ccc(Cl)cc3[nH]2)c2cccc(F)c2)c(Cl)c1 |r|
Show InChI InChI=1S/C25H18Cl3FN6O/c1-13-31-12-35(34-13)17-9-19(27)23(20(28)10-17)25(36)30-11-18(14-3-2-4-16(29)7-14)24-32-21-6-5-15(26)8-22(21)33-24/h2-10,12,18H,11H2,1H3,(H,30,36)(H,32,33)/t18-/m0/s1
Reactome pathway
n/an/a 5.35E+3n/an/an/an/an/an/a
Merck Research Laboratories
Curated by ChEMBL
Assay Description
Inhibition of human ERG
Bioorg Med Chem Lett 25: 4945-9 (2015)
BindingDB Entry DOI: 10.7270/Q20Z753B
Cytochrome P450 2D6
(Homo sapiens (Human))
BDBM50125974
(CHEMBL3627895 | US10189819, Example 46)
Show SMILES Cc1ncn(n1)-c1cc(Cl)c(C(=O)NC[C@H](c2nc3ccc(Cl)cc3[nH]2)c2cccc(F)c2)c(Cl)c1 |r|
Show InChI InChI=1S/C25H18Cl3FN6O/c1-13-31-12-35(34-13)17-9-19(27)23(20(28)10-17)25(36)30-11-18(14-3-2-4-16(29)7-14)24-32-21-6-5-15(26)8-22(21)33-24/h2-10,12,18H,11H2,1H3,(H,30,36)(H,32,33)/t18-/m0/s1
n/an/a 3.04E+4n/an/an/an/an/an/a
Merck Research Laboratories
Curated by ChEMBL
Assay Description
Inhibition of CYP2D6 (unknown origin)
Bioorg Med Chem Lett 25: 4945-9 (2015)
BindingDB Entry DOI: 10.7270/Q20Z753B
Cytochrome P450 3A4
(Homo sapiens (Human))
BDBM50125974
(CHEMBL3627895 | US10189819, Example 46)
Show SMILES Cc1ncn(n1)-c1cc(Cl)c(C(=O)NC[C@H](c2nc3ccc(Cl)cc3[nH]2)c2cccc(F)c2)c(Cl)c1 |r|
Show InChI InChI=1S/C25H18Cl3FN6O/c1-13-31-12-35(34-13)17-9-19(27)23(20(28)10-17)25(36)30-11-18(14-3-2-4-16(29)7-14)24-32-21-6-5-15(26)8-22(21)33-24/h2-10,12,18H,11H2,1H3,(H,30,36)(H,32,33)/t18-/m0/s1
Reactome pathway
n/an/a>5.00E+4n/an/an/an/an/an/a
Merck Research Laboratories
Curated by ChEMBL
Assay Description
Inhibition of CYP3A4 (unknown origin)
Bioorg Med Chem Lett 25: 4945-9 (2015)
BindingDB Entry DOI: 10.7270/Q20Z753B
Coagulation factor IX
(Homo sapiens (Human))
BDBM50125974
(CHEMBL3627895 | US10189819, Example 46)
Show SMILES Cc1ncn(n1)-c1cc(Cl)c(C(=O)NC[C@H](c2nc3ccc(Cl)cc3[nH]2)c2cccc(F)c2)c(Cl)c1 |r|
Show InChI InChI=1S/C25H18Cl3FN6O/c1-13-31-12-35(34-13)17-9-19(27)23(20(28)10-17)25(36)30-11-18(14-3-2-4-16(29)7-14)24-32-21-6-5-15(26)8-22(21)33-24/h2-10,12,18H,11H2,1H3,(H,30,36)(H,32,33)/t18-/m0/s1
Reactome pathway
US Patent
n/an/a 9.78n/an/an/an/an/an/a
Merck Sharp & Dohme, Corp.; Mochida Paraceuticals Co., Ltd.
US Patent
Assay Description
Formation of a clot to stem bleeding at a site of blood vessel injury involves the coordinated activity of a group of plasma proteins that initiate a...
US Patent US10189819 (2019)
BindingDB Entry DOI: 10.7270/Q200046Z
Cytochrome P450 2C9
(Homo sapiens (Human))
BDBM50125974
(CHEMBL3627895 | US10189819, Example 46)
Show SMILES Cc1ncn(n1)-c1cc(Cl)c(C(=O)NC[C@H](c2nc3ccc(Cl)cc3[nH]2)c2cccc(F)c2)c(Cl)c1 |r|
Show InChI InChI=1S/C25H18Cl3FN6O/c1-13-31-12-35(34-13)17-9-19(27)23(20(28)10-17)25(36)30-11-18(14-3-2-4-16(29)7-14)24-32-21-6-5-15(26)8-22(21)33-24/h2-10,12,18H,11H2,1H3,(H,30,36)(H,32,33)/t18-/m0/s1
Reactome pathway
n/an/a 1.98E+4n/an/an/an/an/an/a
Merck Research Laboratories
Curated by ChEMBL
Assay Description
Inhibition of CYP2C9 (unknown origin)
Bioorg Med Chem Lett 25: 4945-9 (2015)
BindingDB Entry DOI: 10.7270/Q20Z753B
Cytochrome P450 2C8
(Homo sapiens (Human))
BDBM50125974
(CHEMBL3627895 | US10189819, Example 46)
Show SMILES Cc1ncn(n1)-c1cc(Cl)c(C(=O)NC[C@H](c2nc3ccc(Cl)cc3[nH]2)c2cccc(F)c2)c(Cl)c1 |r|
Show InChI InChI=1S/C25H18Cl3FN6O/c1-13-31-12-35(34-13)17-9-19(27)23(20(28)10-17)25(36)30-11-18(14-3-2-4-16(29)7-14)24-32-21-6-5-15(26)8-22(21)33-24/h2-10,12,18H,11H2,1H3,(H,30,36)(H,32,33)/t18-/m0/s1
n/an/a 5.28E+3n/an/an/an/an/an/a
Merck Research Laboratories
Curated by ChEMBL
Assay Description
Inhibition of CYP2C8 (unknown origin)
Bioorg Med Chem Lett 25: 4945-9 (2015)
BindingDB Entry DOI: 10.7270/Q20Z753B