BDBM50126153 CHEMBL3629576
SMILES: CC(C)Oc1ccc(cc1-n1c(CN2CCN(CC2)C(=O)COc2ccc(Cl)cc2)nc2ccccc2c1=O)C(C)=O
InChI Key: InChIKey=ATCMKDQGMKHRFI-UHFFFAOYSA-N
Data: 1 IC50
Activity Spreadsheet -- Enzyme Inhibition Constant Data from BindingDB
Found 1 hit for monomerid = 50126153
Trg + Lig
Ki
nM
ΔG°
kcal/mole
IC50
nM
Kd
nM
EC50/IC50
nM
koff
s-1
kon
M-1s-1
pHTemp
°C
Cystine/glutamate transporter
(Homo sapiens (Human))
BDBM50126153
(CHEMBL3629576)
Show SMILES CC(C)Oc1ccc(cc1-n1c(CN2CCN(CC2)C(=O)COc2ccc(Cl)cc2)nc2ccccc2c1=O)C(C)=O |(1.61,6.02,;2.67,5.4,;3.74,6.01,;2.67,3.85,;4,3.08,;5.33,3.85,;6.67,3.07,;6.66,1.53,;5.33,.77,;4,1.54,;2.66,.77,;2.66,-.77,;3.99,-1.54,;3.99,-3.08,;5.32,-3.86,;5.32,-5.4,;3.98,-6.16,;2.65,-5.39,;2.66,-3.85,;3.97,-7.7,;5.04,-8.33,;2.64,-8.47,;2.63,-10.01,;1.29,-10.77,;1.28,-12.31,;-.06,-13.07,;-1.39,-12.29,;-2.46,-12.9,;-1.38,-10.75,;-.04,-9.99,;1.33,-1.54,;,-.77,;-1.33,-1.54,;-2.68,-.77,;-2.68,.77,;-1.33,1.54,;,.77,;1.33,1.54,;1.33,2.77,;8,.76,;8,-.47,;9.07,1.38,)|
Show InChI InChI=1S/C32H33ClN4O5/c1-21(2)42-29-13-8-23(22(3)38)18-28(29)37-30(34-27-7-5-4-6-26(27)32(37)40)19-35-14-16-36(17-15-35)31(39)20-41-25-11-9-24(33)10-12-25/h4-13,18,21H,14-17,19-20H2,1-3H3
Reactome pathway
n/an/a 30n/an/an/an/an/an/a
Columbia University
Curated by ChEMBL
Assay Description
Inhibition of Xct in human CCF-STTG1 cells assessed as glutamate release after 2 hrs by fluorometry
Bioorg Med Chem Lett 25: 4787-92 (2015)
BindingDB Entry DOI: 10.7270/Q27H1MD5