BDBM50126455 (6R,12aR)-6-Benzo[1,3]dioxol-5-yl-2-[(R)-1-(2-pyridin-3-yl-ethyl)-pyrrolidin-3-yl]-2,3,6,7,12,12a-hexahydro-pyrazino[1',2':1,6]pyrido[3,4-b]indole-1,4-dione::CHEMBL33518
SMILES: O=C1CN([C@@H]2CCN(CCc3cccnc3)C2)C(=O)[C@H]2Cc3c([nH]c4ccccc34)[C@H](N12)c1ccc2OCOc2c1
InChI Key: InChIKey=VJFJSFWLQFMARN-PCFFTZKOSA-N
Data: 3 IC50
Activity Spreadsheet -- Enzyme Inhibition Constant Data from BindingDB
Found 3 hits for monomerid = 50126455
Trg + Lig
Ki
nM
ΔG°
kcal/mole
IC50
nM
Kd
nM
EC50/IC50
nM
koff
s-1
kon
M-1s-1
pHTemp
°C
cGMP-specific 3',5'-cyclic phosphodiesterase
(Homo sapiens (Human))
BDBM50126455
((6R,12aR)-6-Benzo[1,3]dioxol-5-yl-2-[(R)-1-(2-pyri...)
Show SMILES O=C1CN([C@@H]2CCN(CCc3cccnc3)C2)C(=O)[C@H]2Cc3c([nH]c4ccccc34)[C@H](N12)c1ccc2OCOc2c1
Show InChI InChI=1S/C32H31N5O4/c38-29-18-36(22-10-13-35(17-22)12-9-20-4-3-11-33-16-20)32(39)26-15-24-23-5-1-2-6-25(23)34-30(24)31(37(26)29)21-7-8-27-28(14-21)41-19-40-27/h1-8,11,14,16,22,26,31,34H,9-10,12-13,15,17-19H2/t22-,26-,31-/m1/s1
Reactome pathway
n/an/a 1.90n/an/an/an/an/an/a
Pfizer Global Research and Development
Curated by ChEMBL
Assay Description
Inhibitory activity against phosphodiesterase 5 (PDE5) obtained from human corpus cavernosum tissue
Bioorg Med Chem Lett 13: 1425-8 (2003)
BindingDB Entry DOI: 10.7270/Q2GM86N6
3D
3D Structure (docked)
Phosphodiesterase 6
(Homo sapiens (Human))
BDBM50126455
((6R,12aR)-6-Benzo[1,3]dioxol-5-yl-2-[(R)-1-(2-pyri...)
Show SMILES O=C1CN([C@@H]2CCN(CCc3cccnc3)C2)C(=O)[C@H]2Cc3c([nH]c4ccccc34)[C@H](N12)c1ccc2OCOc2c1
Show InChI InChI=1S/C32H31N5O4/c38-29-18-36(22-10-13-35(17-22)12-9-20-4-3-11-33-16-20)32(39)26-15-24-23-5-1-2-6-25(23)34-30(24)31(37(26)29)21-7-8-27-28(14-21)41-19-40-27/h1-8,11,14,16,22,26,31,34H,9-10,12-13,15,17-19H2/t22-,26-,31-/m1/s1
n/an/a 271n/an/an/an/an/an/a
Pfizer Global Research and Development
Curated by ChEMBL
Assay Description
Inhibitory activity against phosphodiesterase 6 (PDE6) obtained from canine or bovine retina
Bioorg Med Chem Lett 13: 1425-8 (2003)
BindingDB Entry DOI: 10.7270/Q2GM86N6
Phosphodiesterase 11A (PDE11A)
(Homo sapiens (Human))
BDBM50126455
((6R,12aR)-6-Benzo[1,3]dioxol-5-yl-2-[(R)-1-(2-pyri...)
Show SMILES O=C1CN([C@@H]2CCN(CCc3cccnc3)C2)C(=O)[C@H]2Cc3c([nH]c4ccccc34)[C@H](N12)c1ccc2OCOc2c1
Show InChI InChI=1S/C32H31N5O4/c38-29-18-36(22-10-13-35(17-22)12-9-20-4-3-11-33-16-20)32(39)26-15-24-23-5-1-2-6-25(23)34-30(24)31(37(26)29)21-7-8-27-28(14-21)41-19-40-27/h1-8,11,14,16,22,26,31,34H,9-10,12-13,15,17-19H2/t22-,26-,31-/m1/s1
n/an/a 2.40n/an/an/an/an/an/a
Pfizer Global Research and Development
Curated by ChEMBL
Assay Description
Inhibitory activity against phosphodiesterase 11 (PDE11) obtained from recombinant Sf9 expression
Bioorg Med Chem Lett 13: 1425-8 (2003)
BindingDB Entry DOI: 10.7270/Q2GM86N6