BDBM50126735 7-(3-Amino-propenyl)-2-(2,6-dichloro-phenylamino)-1,6-dimethyl-1,8-dihydro-imidazo[4,5-h]isoquinolin-9-one::CHEMBL30230
SMILES: Cc1c(C=CCN)[nH]c(=O)c2c3n(C)c(Nc4c(Cl)cccc4Cl)nc3ccc12
InChI Key: InChIKey=JIFORZFLPPLPJM-UHFFFAOYSA-N
Data: 1 IC50
Activity Spreadsheet -- Enzyme Inhibition Constant Data from BindingDB
Found 1 hit for monomerid = 50126735
Trg + Lig
Ki
nM
ΔG°
kcal/mole
IC50
nM
Kd
nM
EC50/IC50
nM
koff
s-1
kon
M-1s-1
pHTemp
°C
Tyrosine-protein kinase Lck
(Homo sapiens (Human))
BDBM50126735
(7-(3-Amino-propenyl)-2-(2,6-dichloro-phenylamino)-...)
Show SMILES Cc1c(C=CCN)[nH]c(=O)c2c3n(C)c(Nc4c(Cl)cccc4Cl)nc3ccc12 |w:4.4|
Show InChI InChI=1S/C21H19Cl2N5O/c1-11-12-8-9-16-19(17(12)20(29)25-15(11)7-4-10-24)28(2)21(26-16)27-18-13(22)5-3-6-14(18)23/h3-9H,10,24H2,1-2H3,(H,25,29)(H,26,27)
n/an/a 2n/an/an/an/an/an/a
Boehringer Ingelheim Pharmaceuticals
Curated by ChEMBL
Assay Description
Inhibition of p56 Lck tyrosine kinase
J Med Chem 46: 1337-49 (2003)
Article DOI: 10.1021/jm020446l
BindingDB Entry DOI: 10.7270/Q2DN44FW