BDBM50126741 CHEMBL281271::[2-(2,6-Dichloro-phenylamino)-1,7-dimethyl-9-oxo-8,9-dihydro-1H-imidazo[4,5-h]isoquinolin-6-yl]-acetic acid ethyl ester
SMILES: CCOC(=O)Cc1c(C)[nH]c(=O)c2c3n(C)c(Nc4c(Cl)cccc4Cl)nc3ccc12
InChI Key: InChIKey=MPFUKHIECMGCDU-UHFFFAOYSA-N
Data: 1 IC50
Activity Spreadsheet -- Enzyme Inhibition Constant Data from BindingDB
Found 1 hit for monomerid = 50126741
Trg + Lig
Ki
nM
ΔG°
kcal/mole
IC50
nM
Kd
nM
EC50/IC50
nM
koff
s-1
kon
M-1s-1
pHTemp
°C
Tyrosine-protein kinase Lck
(Homo sapiens (Human))
BDBM50126741
(CHEMBL281271 | [2-(2,6-Dichloro-phenylamino)-1,7-d...)
Show SMILES CCOC(=O)Cc1c(C)[nH]c(=O)c2c3n(C)c(Nc4c(Cl)cccc4Cl)nc3ccc12
Show InChI InChI=1S/C22H20Cl2N4O3/c1-4-31-17(29)10-13-11(2)25-21(30)18-12(13)8-9-16-20(18)28(3)22(26-16)27-19-14(23)6-5-7-15(19)24/h5-9H,4,10H2,1-3H3,(H,25,30)(H,26,27)
n/an/a 700n/an/an/an/an/an/a
Boehringer Ingelheim Pharmaceuticals
Curated by ChEMBL
Assay Description
Inhibition of p56 Lck tyrosine kinase
J Med Chem 46: 1337-49 (2003)
Article DOI: 10.1021/jm020446l
BindingDB Entry DOI: 10.7270/Q2DN44FW