BDBM50126743 7-[3-(Benzyl-methyl-amino)-propenyl]-2-(2,6-dichloro-phenylamino)-1,6-dimethyl-1,8-dihydro-imidazo[4,5-h]isoquinolin-9-one::CHEMBL26214
SMILES: CN(CC=Cc1[nH]c(=O)c2c3n(C)c(Nc4c(Cl)cccc4Cl)nc3ccc2c1C)Cc1ccccc1
InChI Key: InChIKey=KVIAFXPENGVEIA-UHFFFAOYSA-N
Data: 1 IC50
Activity Spreadsheet -- Enzyme Inhibition Constant Data from BindingDB
Found 1 hit for monomerid = 50126743
Trg + Lig
Ki
nM
ΔG°
kcal/mole
IC50
nM
Kd
nM
EC50/IC50
nM
koff
s-1
kon
M-1s-1
pHTemp
°C
Tyrosine-protein kinase Lck
(Homo sapiens (Human))
BDBM50126743
(7-[3-(Benzyl-methyl-amino)-propenyl]-2-(2,6-dichlo...)
Show SMILES CN(CC=Cc1[nH]c(=O)c2c3n(C)c(Nc4c(Cl)cccc4Cl)nc3ccc2c1C)Cc1ccccc1 |w:3.2|
Show InChI InChI=1S/C29H27Cl2N5O/c1-18-20-14-15-24-27(36(3)29(33-24)34-26-21(30)11-7-12-22(26)31)25(20)28(37)32-23(18)13-8-16-35(2)17-19-9-5-4-6-10-19/h4-15H,16-17H2,1-3H3,(H,32,37)(H,33,34)
n/an/a 10n/an/an/an/an/an/a
Boehringer Ingelheim Pharmaceuticals
Curated by ChEMBL
Assay Description
Inhibition of p56 Lck tyrosine kinase
J Med Chem 46: 1337-49 (2003)
Article DOI: 10.1021/jm020446l
BindingDB Entry DOI: 10.7270/Q2DN44FW