BDBM50126749 2-(2,6-Dichloro-phenylamino)-1,6-dimethyl-7-(3-morpholin-4-yl-propenyl)-1,8-dihydro-imidazo[4,5-h]isoquinolin-9-one::CHEMBL424220
SMILES: Cc1c(C=CCN2CCOCC2)[nH]c(=O)c2c3n(C)c(Nc4c(Cl)cccc4Cl)nc3ccc12
InChI Key: InChIKey=WIOZREBVAPDXDM-UHFFFAOYSA-N
Data: 1 IC50
Activity Spreadsheet -- Enzyme Inhibition Constant Data from BindingDB
Found 1 hit for monomerid = 50126749
Trg + Lig
Ki
nM
ΔG°
kcal/mole
IC50
nM
Kd
nM
EC50/IC50
nM
koff
s-1
kon
M-1s-1
pHTemp
°C
Tyrosine-protein kinase Lck
(Homo sapiens (Human))
BDBM50126749
(2-(2,6-Dichloro-phenylamino)-1,6-dimethyl-7-(3-mor...)
Show SMILES Cc1c(C=CCN2CCOCC2)[nH]c(=O)c2c3n(C)c(Nc4c(Cl)cccc4Cl)nc3ccc12 |w:4.4|
Show InChI InChI=1S/C25H25Cl2N5O2/c1-15-16-8-9-20-23(31(2)25(29-20)30-22-17(26)5-3-6-18(22)27)21(16)24(33)28-19(15)7-4-10-32-11-13-34-14-12-32/h3-9H,10-14H2,1-2H3,(H,28,33)(H,29,30)
n/an/a 4n/an/an/an/an/an/a
Boehringer Ingelheim Pharmaceuticals
Curated by ChEMBL
Assay Description
Inhibition of p56 Lck tyrosine kinase
J Med Chem 46: 1337-49 (2003)
Article DOI: 10.1021/jm020446l
BindingDB Entry DOI: 10.7270/Q2DN44FW