BDBM50126752 2-(2,6-Dichloro-phenylamino)-7-(2-hydroxy-vinyl)-1,6-dimethyl-1,8-dihydro-imidazo[4,5-h]isoquinolin-9-one::CHEMBL27485
SMILES: Cc1c(CC=O)[nH]c(=O)c2c3n(C)c(Nc4c(Cl)cccc4Cl)nc3ccc12
InChI Key: InChIKey=RXIFVPVZUDLWDI-UHFFFAOYSA-N
Data: 1 IC50
Activity Spreadsheet -- Enzyme Inhibition Constant Data from BindingDB
Found 1 hit for monomerid = 50126752
Trg + Lig
Ki
nM
ΔG°
kcal/mole
IC50
nM
Kd
nM
EC50/IC50
nM
koff
s-1
kon
M-1s-1
pHTemp
°C
Tyrosine-protein kinase Lck
(Homo sapiens (Human))
BDBM50126752
(2-(2,6-Dichloro-phenylamino)-7-(2-hydroxy-vinyl)-1...)
Show SMILES Cc1c(CC=O)[nH]c(=O)c2c3n(C)c(Nc4c(Cl)cccc4Cl)nc3ccc12
Show InChI InChI=1S/C20H16Cl2N4O2/c1-10-11-6-7-15-18(16(11)19(28)23-14(10)8-9-27)26(2)20(24-15)25-17-12(21)4-3-5-13(17)22/h3-7,9H,8H2,1-2H3,(H,23,28)(H,24,25)
n/an/a 9n/an/an/an/an/an/a
Boehringer Ingelheim Pharmaceuticals
Curated by ChEMBL
Assay Description
Inhibition of p56 Lck tyrosine kinase
J Med Chem 46: 1337-49 (2003)
Article DOI: 10.1021/jm020446l
BindingDB Entry DOI: 10.7270/Q2DN44FW