BDBM50126926 CHEMBL3628835::US10351558, Example 183
SMILES: Cc1ncn(n1)-c1ccc(C(=O)N[C@@]2(CCc3c(CCC(O)=O)c4cc(C)ccc4n3C2)c2ccccc2)c(Cl)c1
InChI Key: InChIKey=KPJWUKSEMFQHIW-JGCGQSQUSA-N
Data: 2 KI  1 IC50
Activity Spreadsheet -- Enzyme Inhibition Constant Data from BindingDB
Found 3 hits for monomerid = 50126926
Trg + Lig
Ki
nM
ΔG°
kcal/mole
IC50
nM
Kd
nM
EC50/IC50
nM
koff
s-1
kon
M-1s-1
pHTemp
°C
Coagulation factor IX
(Homo sapiens (Human))
BDBM50126926
(CHEMBL3628835 | US10351558, Example 183)
Show SMILES Cc1ncn(n1)-c1ccc(C(=O)N[C@@]2(CCc3c(CCC(O)=O)c4cc(C)ccc4n3C2)c2ccccc2)c(Cl)c1 |r|
Show InChI InChI=1S/C32H30ClN5O3/c1-20-8-12-28-26(16-20)24(11-13-30(39)40)29-14-15-32(18-37(28)29,22-6-4-3-5-7-22)35-31(41)25-10-9-23(17-27(25)33)38-19-34-21(2)36-38/h3-10,12,16-17,19H,11,13-15,18H2,1-2H3,(H,35,41)(H,39,40)/t32-/m1/s1
Reactome pathway
2.70n/an/an/an/an/an/an/an/a
Merck Research Laboratories
Curated by ChEMBL
Assay Description
Inhibition of human F9a using CH3SO2-D-CHG-Gly-Arg-AFC.AcOH as substrate by fluorescence assay
Bioorg Med Chem Lett 25: 5437-43 (2015)
BindingDB Entry DOI: 10.7270/Q2B859X6
Coagulation factor X
(Homo sapiens (Human))
BDBM50126926
(CHEMBL3628835 | US10351558, Example 183)
Show SMILES Cc1ncn(n1)-c1ccc(C(=O)N[C@@]2(CCc3c(CCC(O)=O)c4cc(C)ccc4n3C2)c2ccccc2)c(Cl)c1 |r|
Show InChI InChI=1S/C32H30ClN5O3/c1-20-8-12-28-26(16-20)24(11-13-30(39)40)29-14-15-32(18-37(28)29,22-6-4-3-5-7-22)35-31(41)25-10-9-23(17-27(25)33)38-19-34-21(2)36-38/h3-10,12,16-17,19H,11,13-15,18H2,1-2H3,(H,35,41)(H,39,40)/t32-/m1/s1
Reactome pathway
4.23E+3n/an/an/an/an/an/an/an/a
Merck Research Laboratories
Curated by ChEMBL
Assay Description
Inhibition of human F10a using CH3SO2-D-CHG-Gly-Arg-AFC.AcOH as substrate by fluorescence assay
Bioorg Med Chem Lett 25: 5437-43 (2015)
BindingDB Entry DOI: 10.7270/Q2B859X6
Coagulation factor IX
(Homo sapiens (Human))
BDBM50126926
(CHEMBL3628835 | US10351558, Example 183)
Show SMILES Cc1ncn(n1)-c1ccc(C(=O)N[C@@]2(CCc3c(CCC(O)=O)c4cc(C)ccc4n3C2)c2ccccc2)c(Cl)c1 |r|
Show InChI InChI=1S/C32H30ClN5O3/c1-20-8-12-28-26(16-20)24(11-13-30(39)40)29-14-15-32(18-37(28)29,22-6-4-3-5-7-22)35-31(41)25-10-9-23(17-27(25)33)38-19-34-21(2)36-38/h3-10,12,16-17,19H,11,13-15,18H2,1-2H3,(H,35,41)(H,39,40)/t32-/m1/s1
Reactome pathway
US Patent
n/an/a 2.69n/an/an/an/an/an/a
Merck Sharp & Dohme Corp
US Patent
Assay Description
TBD
US Patent US10351558 (2019)
BindingDB Entry DOI: 10.7270/Q2SX6GKR