null
SMILES: Nc1nc2cc(Cl)ccc2o1
InChI Key: InChIKey=YGCODSQDUUUKIV-UHFFFAOYSA-N
PDB links: 1 PDB ID matches this monomer.
Activity Spreadsheet -- Enzyme Inhibition Constant Data from BindingDB
Found 2 hits for monomerid = 50127011
Trg + Lig
Ki
nM
ΔG°
kcal/mole
IC50
nM
Kd
nM
EC50/IC50
nM
koff
s-1
kon
M-1s-1
pHTemp
°C
Bile salt export pump
(Homo sapiens (Human))
BDBM50127011
(CHEBI:35053 | Zoxazolamine)
Show SMILES Nc1nc2cc(Cl)ccc2o1
Show InChI InChI=1S/C7H5ClN2O/c8-4-1-2-6-5(3-4)10-7(9)11-6/h1-3H,(H2,9,10)
n/an/a>1.00E+6n/an/an/an/an/an/a
AstraZeneca
Curated by ChEMBL
Assay Description
Inhibition of human BSEP expressed in baculovirus transfected fall armyworm Sf21 cell membranes vesicles assessed as reduction in ATP-dependent [3H]-...
Drug Metab Dispos 40: 2332-41 (2012)
Article DOI: 10.1124/dmd.112.047068
BindingDB Entry DOI: 10.7270/Q2ZP488M
Mitogen-activated protein kinase 1
(Homo sapiens (Human))
BDBM50127011
(CHEBI:35053 | Zoxazolamine)
Show SMILES Nc1nc2cc(Cl)ccc2o1
Show InChI InChI=1S/C7H5ClN2O/c8-4-1-2-6-5(3-4)10-7(9)11-6/h1-3H,(H2,9,10)
NCI pathway
Reactome pathway
n/an/an/a 9.40E+5n/an/an/an/an/a
Genentech
Curated by ChEMBL
Assay Description
Binding affinity to ERK2 (unknown origin) by surface plasmon resonance assay
Bioorg Med Chem Lett 25: 4728-32 (2015)
BindingDB Entry DOI: 10.7270/Q2TB18QM
3D
3D Structure (crystal)