null
SMILES: Cc1n[nH]cc1-c1cnc2[nH]ccc2n1
InChI Key: InChIKey=ODDKYYQCNSSSFJ-UHFFFAOYSA-N
Activity Spreadsheet -- Enzyme Inhibition Constant Data from BindingDB
Found 1 hit for monomerid = 50127034
Trg + Lig
Ki
nM
ΔG°
kcal/mole
IC50
nM
Kd
nM
EC50/IC50
nM
koff
s-1
kon
M-1s-1
pHTemp
°C
Mitogen-activated protein kinase 1
(Homo sapiens (Human))
BDBM50127034
(CHEMBL3628364)
Show SMILES Cc1n[nH]cc1-c1cnc2[nH]ccc2n1
Show InChI InChI=1S/C10H9N5/c1-6-7(4-13-15-6)9-5-12-10-8(14-9)2-3-11-10/h2-5H,1H3,(H,11,12)(H,13,15)
NCI pathway
Reactome pathway
n/an/a 2.22E+4n/an/an/an/an/an/a
Genentech
Curated by ChEMBL
Assay Description
Inhibition of ERK2 (unknown origin) using 5FAM-IPTSPITTTYFFFKKK as substrate after 1 hr by LC3K assay
Bioorg Med Chem Lett 25: 4728-32 (2015)
BindingDB Entry DOI: 10.7270/Q2TB18QM