BDBM50127036 CHEMBL3628366
SMILES: c1[nH]c2ncc(nc2c1-c1cccnc1)-c1cccnc1
InChI Key: InChIKey=KSQUMPORCSSMCG-UHFFFAOYSA-N
Data: 1 IC50
Activity Spreadsheet -- Enzyme Inhibition Constant Data from BindingDB
Found 1 hit for monomerid = 50127036
Trg + Lig
Ki
nM
ΔG°
kcal/mole
IC50
nM
Kd
nM
EC50/IC50
nM
koff
s-1
kon
M-1s-1
pHTemp
°C
Mitogen-activated protein kinase 1
(Homo sapiens (Human))
BDBM50127036
(CHEMBL3628366)
Show SMILES c1[nH]c2ncc(nc2c1-c1cccnc1)-c1cccnc1
Show InChI InChI=1S/C16H11N5/c1-3-11(7-17-5-1)13-9-19-16-15(13)21-14(10-20-16)12-4-2-6-18-8-12/h1-10H,(H,19,20)
NCI pathway
Reactome pathway
n/an/a 407n/an/an/an/an/an/a
Genentech
Curated by ChEMBL
Assay Description
Inhibition of ERK2 (unknown origin) using 5FAM-IPTSPITTTYFFFKKK as substrate after 1 hr by LC3K assay
Bioorg Med Chem Lett 25: 4728-32 (2015)
BindingDB Entry DOI: 10.7270/Q2TB18QM