null
SMILES: OC(=O)c1ccc(Cn2nnc3c2C(=O)c2ccccc2C3=O)cc1
InChI Key: InChIKey=VWKCPVFHVAKFAB-UHFFFAOYSA-N
Activity Spreadsheet -- Enzyme Inhibition Constant Data from BindingDB
Found 2 hits for monomerid = 50127159
Trg + Lig
Ki
nM
ΔG°
kcal/mole
IC50
nM
Kd
nM
EC50/IC50
nM
koff
s-1
kon
M-1s-1
pHTemp
°C
Indoleamine 2,3-dioxygenase 1
(Homo sapiens (Human))
BDBM50127159
(CHEMBL3628594)
Show SMILES OC(=O)c1ccc(Cn2nnc3c2C(=O)c2ccccc2C3=O)cc1
Show InChI InChI=1S/C18H11N3O4/c22-16-12-3-1-2-4-13(12)17(23)15-14(16)19-20-21(15)9-10-5-7-11(8-6-10)18(24)25/h1-8H,9H2,(H,24,25)
Reactome pathway
n/an/a 2.32E+3n/an/an/an/an/an/a
National Health Research Institutes
Curated by ChEMBL
Assay Description
Inhibition of recombinant human IDO expressed in Escherichia coli incubated for 1 hr measured by fluorescence assay
J Med Chem 58: 7807-19 (2015)
BindingDB Entry DOI: 10.7270/Q2JS9S7K
Tryptophan 2,3-dioxygenase
(Homo sapiens (Human))
BDBM50127159
(CHEMBL3628594)
Show SMILES OC(=O)c1ccc(Cn2nnc3c2C(=O)c2ccccc2C3=O)cc1
Show InChI InChI=1S/C18H11N3O4/c22-16-12-3-1-2-4-13(12)17(23)15-14(16)19-20-21(15)9-10-5-7-11(8-6-10)18(24)25/h1-8H,9H2,(H,24,25)
Reactome pathway
n/an/a 312n/an/an/an/an/an/a
National Health Research Institutes
Curated by ChEMBL
Assay Description
Inhibition of recombinant human TDO expressed in Escherichia coli incubated for 1 hr measured by fluorescence assay
J Med Chem 58: 7807-19 (2015)
BindingDB Entry DOI: 10.7270/Q2JS9S7K