BDBM50127224 3-{4-[4-Methyl-2-(4-trifluoromethyl-phenyl)-oxazol-5-ylmethoxy]-phenyl}-propionic acid::CHEMBL39687
SMILES: Cc1nc(oc1COc1ccc(CCC(O)=O)cc1)-c1ccc(cc1)C(F)(F)F
InChI Key: InChIKey=CYZPDBCUTFGAPE-UHFFFAOYSA-N
Data: 1 IC50  3 EC50
Activity Spreadsheet -- Enzyme Inhibition Constant Data from BindingDB
Found 4 hits for monomerid = 50127224
Trg + Lig
Ki
nM
ΔG°
kcal/mole
IC50
nM
Kd
nM
EC50/IC50
nM
koff
s-1
kon
M-1s-1
pHTemp
°C
Peroxisome proliferator-activated receptor delta
(Homo sapiens (Human))
BDBM50127224
(3-{4-[4-Methyl-2-(4-trifluoromethyl-phenyl)-oxazol...)
Show SMILES Cc1nc(oc1COc1ccc(CCC(O)=O)cc1)-c1ccc(cc1)C(F)(F)F
Show InChI InChI=1S/C21H18F3NO4/c1-13-18(12-28-17-9-2-14(3-10-17)4-11-19(26)27)29-20(25-13)15-5-7-16(8-6-15)21(22,23)24/h2-3,5-10H,4,11-12H2,1H3,(H,26,27)
n/an/an/an/a 60n/an/an/an/a
GlaxoSmithKline
Curated by ChEMBL
Assay Description
Maximum transcriptional activation of human PPAR delta receptor
Bioorg Med Chem Lett 13: 1517-21 (2003)
BindingDB Entry DOI: 10.7270/Q2VQ322G
Peroxisome proliferator-activated receptor delta
(Homo sapiens (Human))
BDBM50127224
(3-{4-[4-Methyl-2-(4-trifluoromethyl-phenyl)-oxazol...)
Show SMILES Cc1nc(oc1COc1ccc(CCC(O)=O)cc1)-c1ccc(cc1)C(F)(F)F
Show InChI InChI=1S/C21H18F3NO4/c1-13-18(12-28-17-9-2-14(3-10-17)4-11-19(26)27)29-20(25-13)15-5-7-16(8-6-15)21(22,23)24/h2-3,5-10H,4,11-12H2,1H3,(H,26,27)
n/an/a 90n/an/an/an/an/an/a
GlaxoSmithKline
Curated by ChEMBL
Assay Description
Binding affinity for human PPAR delta receptor
Bioorg Med Chem Lett 13: 1517-21 (2003)
BindingDB Entry DOI: 10.7270/Q2VQ322G
Peroxisome proliferator-activated receptor alpha (PPAR alpha)
(Homo sapiens (Human))
BDBM50127224
(3-{4-[4-Methyl-2-(4-trifluoromethyl-phenyl)-oxazol...)
Show SMILES Cc1nc(oc1COc1ccc(CCC(O)=O)cc1)-c1ccc(cc1)C(F)(F)F
Show InChI InChI=1S/C21H18F3NO4/c1-13-18(12-28-17-9-2-14(3-10-17)4-11-19(26)27)29-20(25-13)15-5-7-16(8-6-15)21(22,23)24/h2-3,5-10H,4,11-12H2,1H3,(H,26,27)
n/an/an/an/a 280n/an/an/an/a
GlaxoSmithKline
Curated by ChEMBL
Assay Description
Maximum transcriptional activation of human PPAR alpha receptor
Bioorg Med Chem Lett 13: 1517-21 (2003)
BindingDB Entry DOI: 10.7270/Q2VQ322G
Peroxisome proliferator-activated receptor
(Homo sapiens (Human))
BDBM50127224
(3-{4-[4-Methyl-2-(4-trifluoromethyl-phenyl)-oxazol...)
Show SMILES Cc1nc(oc1COc1ccc(CCC(O)=O)cc1)-c1ccc(cc1)C(F)(F)F
Show InChI InChI=1S/C21H18F3NO4/c1-13-18(12-28-17-9-2-14(3-10-17)4-11-19(26)27)29-20(25-13)15-5-7-16(8-6-15)21(22,23)24/h2-3,5-10H,4,11-12H2,1H3,(H,26,27)
NCI pathway
Reactome pathway
n/an/an/an/a 3.30E+3n/an/an/an/a
GlaxoSmithKline
Curated by ChEMBL
Assay Description
Maximum transcriptional activation of human PPAR gamma receptor
Bioorg Med Chem Lett 13: 1517-21 (2003)
BindingDB Entry DOI: 10.7270/Q2VQ322G