BDBM50127245 CHEMBL3628042
SMILES: CN1CCN(CC1)c1nc(N)nc(\C=C\c2cccc(Cl)c2)n1
InChI Key: InChIKey=PATVLDHTCBKUPZ-AATRIKPKSA-N
Data: 2 KI  1 IC50
Activity Spreadsheet -- Enzyme Inhibition Constant Data from BindingDB
Found 3 hits for monomerid = 50127245
Trg + Lig
Ki
nM
ΔG°
kcal/mole
IC50
nM
Kd
nM
EC50/IC50
nM
koff
s-1
kon
M-1s-1
pHTemp
°C
Histamine H4 receptor
(Homo sapiens (Human))
BDBM50127245
(CHEMBL3628042)
Show SMILES CN1CCN(CC1)c1nc(N)nc(\C=C\c2cccc(Cl)c2)n1
Show InChI InChI=1S/C16H19ClN6/c1-22-7-9-23(10-8-22)16-20-14(19-15(18)21-16)6-5-12-3-2-4-13(17)11-12/h2-6,11H,7-10H2,1H3,(H2,18,19,20,21)/b6-5+
Reactome pathway
253n/an/an/an/an/an/an/an/a
Jagiellonian University Medical College
Curated by ChEMBL
Assay Description
Displacement of [3H]histamine from human H4 receptor expressed in Sf9 cell membranes co-expressing Galphai2 and Gbeta1gamma2 after 60 mins by liquid ...
Eur J Med Chem 103: 238-51 (2015)
BindingDB Entry DOI: 10.7270/Q25M67JQ
Histamine H4 Receptor
(Mus musculus (mouse))
BDBM50127245
(CHEMBL3628042)
Show SMILES CN1CCN(CC1)c1nc(N)nc(\C=C\c2cccc(Cl)c2)n1
Show InChI InChI=1S/C16H19ClN6/c1-22-7-9-23(10-8-22)16-20-14(19-15(18)21-16)6-5-12-3-2-4-13(17)11-12/h2-6,11H,7-10H2,1H3,(H2,18,19,20,21)/b6-5+
Reactome pathway
854n/an/an/an/an/an/an/an/a
Jagiellonian University Medical College
Curated by ChEMBL
Assay Description
Displacement of [3H]histamine from mouse H4 receptor expressed in HEK293 cell membranes co-expressing Galphai2 and Gbeta1gamma2 after 1 hr by liquid ...
Eur J Med Chem 103: 238-51 (2015)
BindingDB Entry DOI: 10.7270/Q25M67JQ
Histamine H4 receptor
(Homo sapiens (Human))
BDBM50127245
(CHEMBL3628042)
Show SMILES CN1CCN(CC1)c1nc(N)nc(\C=C\c2cccc(Cl)c2)n1
Show InChI InChI=1S/C16H19ClN6/c1-22-7-9-23(10-8-22)16-20-14(19-15(18)21-16)6-5-12-3-2-4-13(17)11-12/h2-6,11H,7-10H2,1H3,(H2,18,19,20,21)/b6-5+
Reactome pathway
n/an/a 439n/an/an/an/an/an/a
Jagiellonian University Medical College
Curated by ChEMBL
Assay Description
Antagonist activity at human H4R expressed in CHO cells assessed as inhibition of forskolin-induced cAMP accumulation after 30 mins by TR-FRET immuno...
Eur J Med Chem 103: 238-51 (2015)
BindingDB Entry DOI: 10.7270/Q25M67JQ