BDBM50127279 1-Ethyl-7-[(4-fluoro-phenyl)-imidazol-1-yl-methyl]-2,3-dihydro-1H-indole::CHEMBL39403
SMILES: CCN1CCc2cccc(C(c3ccc(F)cc3)n3ccnc3)c12
InChI Key: InChIKey=CDHZWHPOFLCSEF-UHFFFAOYSA-N
Data: 1 IC50
Activity Spreadsheet -- Enzyme Inhibition Constant Data from BindingDB
Found 1 hit for monomerid = 50127279
Trg + Lig
Ki
nM
ΔG°
kcal/mole
IC50
nM
Kd
nM
EC50/IC50
nM
koff
s-1
kon
M-1s-1
pHTemp
°C
Cytochrome P450 19A1
(Homo sapiens (Human))
BDBM50127279
(1-Ethyl-7-[(4-fluoro-phenyl)-imidazol-1-yl-methyl]...)
Show SMILES CCN1CCc2cccc(C(c3ccc(F)cc3)n3ccnc3)c12
Show InChI InChI=1S/C20H20FN3/c1-2-23-12-10-15-4-3-5-18(19(15)23)20(24-13-11-22-14-24)16-6-8-17(21)9-7-16/h3-9,11,13-14,20H,2,10,12H2,1H3
Reactome pathway
n/an/a 62n/an/an/an/an/an/a
UFR des Sciences Pharmaceutiques
Curated by ChEMBL
Assay Description
In vitro inhibitiion of cytochrome P450 19A1 from human placental microsomes with 2.5 uM [1beta,2beta-3H]testosterone
Bioorg Med Chem Lett 13: 1553-5 (2003)
BindingDB Entry DOI: 10.7270/Q2GH9HB7