BDBM50127457 2-[7-(2,6-Dimethyl-pyridin-4-ylmethoxy)-1,1-dioxo-1,3,4,5-tetrahydro-1lambda*6*-benzo[f][1,2,5]thiadiazepin-2-yl]-N-hydroxy-propionamide::CHEMBL299796
SMILES: C[C@@H](N1CCNc2cc(OCc3cc(C)nc(C)c3)ccc2S1(=O)=O)C(=O)NO
InChI Key: InChIKey=SZWRRABFHREDHM-CQSZACIVSA-N
Data: 4 KI  1 IC50
Activity Spreadsheet -- Enzyme Inhibition Constant Data from BindingDB
Found 5 hits for monomerid = 50127457
Trg + Lig
Ki
nM
ΔG°
kcal/mole
IC50
nM
Kd
nM
EC50/IC50
nM
koff
s-1
kon
M-1s-1
pHTemp
°C
72 kDa type IV collagenase
(Homo sapiens (Human))
BDBM50127457
(2-[7-(2,6-Dimethyl-pyridin-4-ylmethoxy)-1,1-dioxo-...)
Show SMILES C[C@@H](N1CCNc2cc(OCc3cc(C)nc(C)c3)ccc2S1(=O)=O)C(=O)NO
Show InChI InChI=1S/C19H24N4O5S/c1-12-8-15(9-13(2)21-12)11-28-16-4-5-18-17(10-16)20-6-7-23(29(18,26)27)14(3)19(24)22-25/h4-5,8-10,14,20,25H,6-7,11H2,1-3H3,(H,22,24)/t14-/m1/s1
Reactome pathway
75n/an/an/an/an/an/an/an/a
Bristol-Myers Squibb Pharmaceutical Research Institute
Curated by ChEMBL
Assay Description
In vitro inhibitory activity against broad spectrum matrix metalloprotease-2 (MMP-2)
J Med Chem 46: 1811-23 (2003)
Article DOI: 10.1021/jm020475w
BindingDB Entry DOI: 10.7270/Q2TQ60W7
Disintegrin and metalloproteinase domain-containing protein 17
(Homo sapiens (Human))
BDBM50127457
(2-[7-(2,6-Dimethyl-pyridin-4-ylmethoxy)-1,1-dioxo-...)
Show SMILES C[C@@H](N1CCNc2cc(OCc3cc(C)nc(C)c3)ccc2S1(=O)=O)C(=O)NO
Show InChI InChI=1S/C19H24N4O5S/c1-12-8-15(9-13(2)21-12)11-28-16-4-5-18-17(10-16)20-6-7-23(29(18,26)27)14(3)19(24)22-25/h4-5,8-10,14,20,25H,6-7,11H2,1-3H3,(H,22,24)/t14-/m1/s1
Reactome pathway
544n/an/an/an/an/an/an/an/a
Bristol-Myers Squibb Pharmaceutical Research Institute
Curated by ChEMBL
Assay Description
In vitro inhibitory activity against porcine tumor necrosis factor alpha converting enzyme (pTACE)
J Med Chem 46: 1811-23 (2003)
Article DOI: 10.1021/jm020475w
BindingDB Entry DOI: 10.7270/Q2TQ60W7
Matrix metalloproteinase-9
(Homo sapiens (Human))
BDBM50127457
(2-[7-(2,6-Dimethyl-pyridin-4-ylmethoxy)-1,1-dioxo-...)
Show SMILES C[C@@H](N1CCNc2cc(OCc3cc(C)nc(C)c3)ccc2S1(=O)=O)C(=O)NO
Show InChI InChI=1S/C19H24N4O5S/c1-12-8-15(9-13(2)21-12)11-28-16-4-5-18-17(10-16)20-6-7-23(29(18,26)27)14(3)19(24)22-25/h4-5,8-10,14,20,25H,6-7,11H2,1-3H3,(H,22,24)/t14-/m1/s1
Reactome pathway
1.84E+3n/an/an/an/an/an/an/an/a
Bristol-Myers Squibb Pharmaceutical Research Institute
Curated by ChEMBL
Assay Description
In vitro inhibitory activity against broad spectrum matrix metalloprotease-9 (MMP-9)
J Med Chem 46: 1811-23 (2003)
Article DOI: 10.1021/jm020475w
BindingDB Entry DOI: 10.7270/Q2TQ60W7
Interstitial collagenase
(Homo sapiens (Human))
BDBM50127457
(2-[7-(2,6-Dimethyl-pyridin-4-ylmethoxy)-1,1-dioxo-...)
Show SMILES C[C@@H](N1CCNc2cc(OCc3cc(C)nc(C)c3)ccc2S1(=O)=O)C(=O)NO
Show InChI InChI=1S/C19H24N4O5S/c1-12-8-15(9-13(2)21-12)11-28-16-4-5-18-17(10-16)20-6-7-23(29(18,26)27)14(3)19(24)22-25/h4-5,8-10,14,20,25H,6-7,11H2,1-3H3,(H,22,24)/t14-/m1/s1
Reactome pathway
>4.95E+3n/an/an/an/an/an/an/an/a
Bristol-Myers Squibb Pharmaceutical Research Institute
Curated by ChEMBL
Assay Description
In vitro inhibitory activity against broad spectrum matrix metalloprotease-1 (MMP-1)
J Med Chem 46: 1811-23 (2003)
Article DOI: 10.1021/jm020475w
BindingDB Entry DOI: 10.7270/Q2TQ60W7
Disintegrin and metalloproteinase domain-containing protein 17
(Homo sapiens (Human))
BDBM50127457
(2-[7-(2,6-Dimethyl-pyridin-4-ylmethoxy)-1,1-dioxo-...)
Show SMILES C[C@@H](N1CCNc2cc(OCc3cc(C)nc(C)c3)ccc2S1(=O)=O)C(=O)NO
Show InChI InChI=1S/C19H24N4O5S/c1-12-8-15(9-13(2)21-12)11-28-16-4-5-18-17(10-16)20-6-7-23(29(18,26)27)14(3)19(24)22-25/h4-5,8-10,14,20,25H,6-7,11H2,1-3H3,(H,22,24)/t14-/m1/s1
Reactome pathway
n/an/a 2.90E+3n/an/an/an/an/an/a
Bristol-Myers Squibb Pharmaceutical Research Institute
Curated by ChEMBL
Assay Description
Ability to suppress the formation of TNF-aplha in human peripheral blood mononuclear cell assay(PBMC)
J Med Chem 46: 1811-23 (2003)
Article DOI: 10.1021/jm020475w
BindingDB Entry DOI: 10.7270/Q2TQ60W7