BDBM50127562 1-(2,6-Difluoro-benzyl)-2-(2,6-difluoro-phenyl)-1H-benzoimidazole-4-carboxylic acid amide::1-(2,6-difluorobenzyl)-2-(2,6-difluorophenyl)-1H-benzo[d]imidazole-4-carboxamide::1-(2,6-difluorobenzyl)-2-(2,6-difluorophenyl)benzimidazole-4-carboxylic acid amide::CHEMBL292138
SMILES: NC(=O)c1cccc2n(Cc3c(F)cccc3F)c(nc12)-c1c(F)cccc1F
InChI Key: InChIKey=XLASIXRCZDFALS-UHFFFAOYSA-N
Data: 1 EC50
Activity Spreadsheet -- Enzyme Inhibition Constant Data from BindingDB
Found 1 hit for monomerid = 50127562
Trg + Lig
Ki
nM
ΔG°
kcal/mole
IC50
nM
Kd
nM
EC50/IC50
nM
koff
s-1
kon
M-1s-1
pHTemp
°C
Human immunodeficiency virus type 1 reverse transcriptase
(Human immunodeficiency virus 1)
BDBM50127562
(1-(2,6-Difluoro-benzyl)-2-(2,6-difluoro-phenyl)-1H...)
Show SMILES NC(=O)c1cccc2n(Cc3c(F)cccc3F)c(nc12)-c1c(F)cccc1F |(-6.46,-17.11,;-7.79,-17.88,;-9.13,-17.11,;-7.79,-19.42,;-9.12,-20.19,;-9.12,-21.74,;-7.79,-22.51,;-6.45,-21.73,;-4.98,-22.2,;-4.49,-23.66,;-5.51,-24.81,;-5.03,-26.26,;-3.52,-26.57,;-6.04,-27.41,;-7.56,-27.1,;-8.04,-25.64,;-7.02,-24.49,;-7.5,-23.03,;-4.08,-20.94,;-4.99,-19.7,;-6.45,-20.18,;-2.54,-20.93,;-1.76,-22.26,;-2.53,-23.6,;-.22,-22.26,;.54,-20.92,;-.25,-19.58,;-1.78,-19.6,;-2.56,-18.27,)|
Show InChI InChI=1S/C21H13F4N3O/c22-13-5-2-6-14(23)12(13)10-28-17-9-1-4-11(20(26)29)19(17)27-21(28)18-15(24)7-3-8-16(18)25/h1-9H,10H2,(H2,26,29)
n/an/an/an/a 370n/an/an/an/a
National Cancer Institute-Frederick
Curated by ChEMBL
Assay Description
Inhibition of HIV-1 reverse transcriptase.
J Med Chem 46: 1940-7 (2003)
Article DOI: 10.1021/jm020271f
BindingDB Entry DOI: 10.7270/Q2610ZPC