BDBM50127981 3-(3-Carboxy-propionylamino)-benzoic acid::CHEMBL296834
SMILES: OC(=O)CCC(=O)Nc1cccc(c1)C(O)=O
InChI Key: InChIKey=IKRKGFIXYILHIJ-UHFFFAOYSA-N
Data: 1 IC50
Activity Spreadsheet -- Enzyme Inhibition Constant Data from BindingDB
Found 1 hit for monomerid = 50127981
Trg + Lig
Ki
nM
ΔG°
kcal/mole
IC50
nM
Kd
nM
EC50/IC50
nM
koff
s-1
kon
M-1s-1
pHTemp
°C
Acetylcholinesterase
(Tetronarce californica (Pacific electric ray) (Tor...)
BDBM50127981
(3-(3-Carboxy-propionylamino)-benzoic acid | CHEMBL...)
Show SMILES OC(=O)CCC(=O)Nc1cccc(c1)C(O)=O
Show InChI InChI=1S/C11H11NO5/c13-9(4-5-10(14)15)12-8-3-1-2-7(6-8)11(16)17/h1-3,6H,4-5H2,(H,12,13)(H,14,15)(H,16,17)
n/an/a 93n/an/an/an/an/an/a
Instituto Politécnico Nacional
Curated by ChEMBL
Assay Description
Inhibitory activity of the compound against acetylcholinesterase (AChE) from Torpedo californica (Reversible type of inhibition)
Bioorg Med Chem Lett 13: 1825-7 (2003)
BindingDB Entry DOI: 10.7270/Q2416WF2