BDBM50128058 ALLYL-{6-[3-(4-BROMO-PHENYL)-1-METHYL-1H-INDAZOL-6-YL]OXY}HEXYL)-N-METHYLAMINE::Allyl-{6-[3-(4-bromo-phenyl)-1-methyl-1H-indazol-6-yloxy]-hexyl}-methyl-amine::CHEMBL115497::CHEMBL66424::N-allyl-6-(3-(4-bromophenyl)-1-methyl-1H-indazol-6-yloxy)-N-methylhexan-1-aminium
SMILES: CN(CCCCCCOc1ccc2c(nn(C)c2c1)-c1ccc(Br)cc1)CC=C
InChI Key: InChIKey=FNZKIJOTNKEJBF-UHFFFAOYSA-N
Data: 7 IC50
PDB links: 1 PDB ID matches this monomer.
Activity Spreadsheet -- Enzyme Inhibition Constant Data from BindingDB
Found 7 hits for monomerid = 50128058
Trg + Lig
Ki
nM
ΔG°
kcal/mole
IC50
nM
Kd
nM
EC50/IC50
nM
koff
s-1
kon
M-1s-1
pHTemp
°C
Lanosterol synthase
(Homo sapiens (Human))
BDBM50128058
(ALLYL-{6-[3-(4-BROMO-PHENYL)-1-METHYL-1H-INDAZOL-6...)
Show SMILES CN(CCCCCCOc1ccc2c(nn(C)c2c1)-c1ccc(Br)cc1)CC=C
Show InChI InChI=1S/C24H30BrN3O/c1-4-15-27(2)16-7-5-6-8-17-29-21-13-14-22-23(18-21)28(3)26-24(22)19-9-11-20(25)12-10-19/h4,9-14,18H,1,5-8,15-17H2,2-3H3
Reactome pathway
n/an/a 19.6n/an/an/an/an/an/a
Albert-Ludwigs-Universität
Curated by ChEMBL
Assay Description
Inhibitory activity against Oxidosqualene-lanosterol cyclase from human liver microsomes
J Med Chem 46: 2083-92 (2003)
Article DOI: 10.1021/jm0211218
BindingDB Entry DOI: 10.7270/Q2VM4BM9
Squalene-hopene cyclase
(Alicyclobacillus acidocaldarius)
BDBM50128058
(ALLYL-{6-[3-(4-BROMO-PHENYL)-1-METHYL-1H-INDAZOL-6...)
Show SMILES CN(CCCCCCOc1ccc2c(nn(C)c2c1)-c1ccc(Br)cc1)CC=C
Show InChI InChI=1S/C24H30BrN3O/c1-4-15-27(2)16-7-5-6-8-17-29-21-13-14-22-23(18-21)28(3)26-24(22)19-9-11-20(25)12-10-19/h4,9-14,18H,1,5-8,15-17H2,2-3H3
n/an/a 289n/an/an/an/an/an/a
Albert-Ludwigs-Universität
Curated by ChEMBL
Assay Description
Inhibitory activity against squalene hopene cyclase from Alicyclobacillus acidocaldarius
J Med Chem 46: 2083-92 (2003)
Article DOI: 10.1021/jm0211218
BindingDB Entry DOI: 10.7270/Q2VM4BM9
3D
3D Structure (crystal)
Lanosterol synthase
(Saccharomyces cerevisiae)
BDBM50128058
(ALLYL-{6-[3-(4-BROMO-PHENYL)-1-METHYL-1H-INDAZOL-6...)
Show SMILES CN(CCCCCCOc1ccc2c(nn(C)c2c1)-c1ccc(Br)cc1)CC=C
Show InChI InChI=1S/C24H30BrN3O/c1-4-15-27(2)16-7-5-6-8-17-29-21-13-14-22-23(18-21)28(3)26-24(22)19-9-11-20(25)12-10-19/h4,9-14,18H,1,5-8,15-17H2,2-3H3
Reactome pathway
n/an/a 290n/an/an/an/an/an/a
Università di Torino
Curated by ChEMBL
Assay Description
Inhibition of yeast OSC expressed in Saccharomyces cerevisiae SMY8
Bioorg Med Chem Lett 19: 718-23 (2009)
Article DOI: 10.1016/j.bmcl.2008.12.040
BindingDB Entry DOI: 10.7270/Q2SF2W2N
Lanosterol synthase
(Homo sapiens (Human))
BDBM50128058
(ALLYL-{6-[3-(4-BROMO-PHENYL)-1-METHYL-1H-INDAZOL-6...)
Show SMILES CN(CCCCCCOc1ccc2c(nn(C)c2c1)-c1ccc(Br)cc1)CC=C
Show InChI InChI=1S/C24H30BrN3O/c1-4-15-27(2)16-7-5-6-8-17-29-21-13-14-22-23(18-21)28(3)26-24(22)19-9-11-20(25)12-10-19/h4,9-14,18H,1,5-8,15-17H2,2-3H3
Reactome pathway
n/an/a 19n/an/an/an/an/an/a
Universit£ di Torino
Curated by ChEMBL
Assay Description
Inhibition of oxidosqualene cyclase
J Med Chem 50: 5039-42 (2007)
Article DOI: 10.1021/jm0704651
BindingDB Entry DOI: 10.7270/Q2ZP47FF
Cycloartenol synthase
(Arabidopsis thaliana)
BDBM50128058
(ALLYL-{6-[3-(4-BROMO-PHENYL)-1-METHYL-1H-INDAZOL-6...)
Show SMILES CN(CCCCCCOc1ccc2c(nn(C)c2c1)-c1ccc(Br)cc1)CC=C
Show InChI InChI=1S/C24H30BrN3O/c1-4-15-27(2)16-7-5-6-8-17-29-21-13-14-22-23(18-21)28(3)26-24(22)19-9-11-20(25)12-10-19/h4,9-14,18H,1,5-8,15-17H2,2-3H3
Reactome pathway
n/an/a 2.60E+3n/an/an/an/an/an/a
Università di Torino
Curated by ChEMBL
Assay Description
Inhibition of Arabidopsis thaliana cycloartenol synthase expressed in Saccharomyces cerevisiae SMY8
Bioorg Med Chem Lett 19: 718-23 (2009)
Article DOI: 10.1016/j.bmcl.2008.12.040
BindingDB Entry DOI: 10.7270/Q2SF2W2N
Lanosterol synthase
(Homo sapiens (Human))
BDBM50128058
(ALLYL-{6-[3-(4-BROMO-PHENYL)-1-METHYL-1H-INDAZOL-6...)
Show SMILES CN(CCCCCCOc1ccc2c(nn(C)c2c1)-c1ccc(Br)cc1)CC=C
Show InChI InChI=1S/C24H30BrN3O/c1-4-15-27(2)16-7-5-6-8-17-29-21-13-14-22-23(18-21)28(3)26-24(22)19-9-11-20(25)12-10-19/h4,9-14,18H,1,5-8,15-17H2,2-3H3
Reactome pathway
n/an/a 19.6n/an/an/an/an/an/a
F. Hoffmann-La Roche Ltd.
Curated by ChEMBL
Assay Description
In vitro inhibition of human 2,3-oxidosqualene cyclase.
J Med Chem 46: 3354-70 (2003)
Article DOI: 10.1021/jm021120f
BindingDB Entry DOI: 10.7270/Q29G5NKM
Lanosterol synthase
(Homo sapiens (Human))
BDBM50128058
(ALLYL-{6-[3-(4-BROMO-PHENYL)-1-METHYL-1H-INDAZOL-6...)
Show SMILES CN(CCCCCCOc1ccc2c(nn(C)c2c1)-c1ccc(Br)cc1)CC=C
Show InChI InChI=1S/C24H30BrN3O/c1-4-15-27(2)16-7-5-6-8-17-29-21-13-14-22-23(18-21)28(3)26-24(22)19-9-11-20(25)12-10-19/h4,9-14,18H,1,5-8,15-17H2,2-3H3
Reactome pathway
n/an/a 2.30E+3n/an/an/an/an/an/a
Università di Torino
Curated by ChEMBL
Assay Description
Inhibition of human OSC expressed in Saccharomyces cerevisiae SMY8
Bioorg Med Chem Lett 19: 718-23 (2009)
Article DOI: 10.1016/j.bmcl.2008.12.040
BindingDB Entry DOI: 10.7270/Q2SF2W2N