BDBM50128177 3-((3-(1,1,2,2-tetrafluoroethoxy)benzyl)(3-(cyclohexylmethoxy)phenyl)amino)-1,1,1-trifluoropropan-2-ol::3-((3-(cyclohexylmethoxy)phenyl)(3-(1,1,2,2-tetrafluoroethoxy)benzyl)amino)-1,1,1-trifluoropropan-2-ol::3-{(3-Cyclohexylmethoxy-phenyl)-[3-(1,1,2,2-tetrafluoro-ethoxy)-benzyl]-amino}-1,1,1-trifluoro-propan-2-ol::CHEMBL66703
SMILES: OC(CN(Cc1cccc(OC(F)(F)C(F)F)c1)c1cccc(OCC2CCCCC2)c1)C(F)(F)F
InChI Key: InChIKey=HAAQJFJWWULHGI-UHFFFAOYSA-N
Data: 3 IC50
Activity Spreadsheet -- Enzyme Inhibition Constant Data from BindingDB
Found 3 hits for monomerid = 50128177
Trg + Lig
Ki
nM
ΔG°
kcal/mole
IC50
nM
Kd
nM
EC50/IC50
nM
koff
s-1
kon
M-1s-1
pHTemp
°C
Cholesteryl ester transfer protein
(Homo sapiens (Human))
BDBM50128177
(3-((3-(1,1,2,2-tetrafluoroethoxy)benzyl)(3-(cycloh...)
Show SMILES OC(CN(Cc1cccc(OC(F)(F)C(F)F)c1)c1cccc(OCC2CCCCC2)c1)C(F)(F)F
Show InChI InChI=1S/C25H28F7NO3/c26-23(27)25(31,32)36-21-11-4-8-18(12-21)14-33(15-22(34)24(28,29)30)19-9-5-10-20(13-19)35-16-17-6-2-1-3-7-17/h4-5,8-13,17,22-23,34H,1-3,6-7,14-16H2
Reactome pathway
n/an/a 200n/an/an/an/an/an/a
Pharmacia Discovery Research (Pfizer Global Research and Development)
Curated by ChEMBL
Assay Description
Compound was tested in vitro for inhibitory activity against recombinant human cholesteryl ester transfer protein in buffer
J Med Chem 46: 2152-68 (2003)
Article DOI: 10.1021/jm020528+
BindingDB Entry DOI: 10.7270/Q2QV3KWK
Cholesteryl ester transfer protein
(Oryctolagus cuniculus)
BDBM50128177
(3-((3-(1,1,2,2-tetrafluoroethoxy)benzyl)(3-(cycloh...)
Show SMILES OC(CN(Cc1cccc(OC(F)(F)C(F)F)c1)c1cccc(OCC2CCCCC2)c1)C(F)(F)F
Show InChI InChI=1S/C25H28F7NO3/c26-23(27)25(31,32)36-21-11-4-8-18(12-21)14-33(15-22(34)24(28,29)30)19-9-5-10-20(13-19)35-16-17-6-2-1-3-7-17/h4-5,8-13,17,22-23,34H,1-3,6-7,14-16H2
n/an/a 200n/an/an/an/an/an/a
Al-Zaytoonah Private University of Jordan
Curated by ChEMBL
Assay Description
Inhibition of CETP in rabbit serum after 1 hr by fluorescent cholesteryl esters transfer assay
Eur J Med Chem 45: 1598-617 (2010)
Article DOI: 10.1016/j.ejmech.2009.12.070
BindingDB Entry DOI: 10.7270/Q2VQ32VS
Cholesteryl ester transfer protein
(Homo sapiens (Human))
BDBM50128177
(3-((3-(1,1,2,2-tetrafluoroethoxy)benzyl)(3-(cycloh...)
Show SMILES OC(CN(Cc1cccc(OC(F)(F)C(F)F)c1)c1cccc(OCC2CCCCC2)c1)C(F)(F)F
Show InChI InChI=1S/C25H28F7NO3/c26-23(27)25(31,32)36-21-11-4-8-18(12-21)14-33(15-22(34)24(28,29)30)19-9-5-10-20(13-19)35-16-17-6-2-1-3-7-17/h4-5,8-13,17,22-23,34H,1-3,6-7,14-16H2
Reactome pathway
n/an/a 200n/an/an/an/an/an/a
Universidade Federal da Bahia
Curated by ChEMBL
Assay Description
Inhibition of CETP
Bioorg Med Chem 15: 6242-52 (2007)
Article DOI: 10.1016/j.bmc.2007.06.021
BindingDB Entry DOI: 10.7270/Q2B857VG