BDBM50128185 3-((3-(1,1,2,2-tetrafluoroethoxy)benzyl)(3-(3-ethyl-5-methylphenoxy)phenyl)amino)-1,1,1-trifluoropropan-2-ol::3-((3-(3-ethyl-5-methylphenoxy)phenyl)(3-(1,1,2,2-tetrafluoroethoxy)benzyl)amino)-1,1,1-trifluoropropan-2-ol::3-{[3-(3-Ethyl-5-methyl-phenoxy)-phenyl]-[3-(1,1,2,2-tetrafluoro-ethoxy)-benzyl]-amino}-1,1,1-trifluoro-propan-2-ol::CHEMBL302306
SMILES: CCc1cc(C)cc(Oc2cccc(c2)N(CC(O)C(F)(F)F)Cc2cccc(OC(F)(F)C(F)F)c2)c1
InChI Key: InChIKey=BEKZFLGSXUYIRN-UHFFFAOYSA-N
Data: 5 IC50
Activity Spreadsheet -- Enzyme Inhibition Constant Data from BindingDB
Found 5 hits for monomerid = 50128185
Trg + Lig
Ki
nM
ΔG°
kcal/mole
IC50
nM
Kd
nM
EC50/IC50
nM
koff
s-1
kon
M-1s-1
pHTemp
°C
Cholesteryl ester transfer protein
(Homo sapiens (Human))
BDBM50128185
(3-((3-(1,1,2,2-tetrafluoroethoxy)benzyl)(3-(3-ethy...)
Show SMILES CCc1cc(C)cc(Oc2cccc(c2)N(CC(O)C(F)(F)F)Cc2cccc(OC(F)(F)C(F)F)c2)c1
Show InChI InChI=1S/C27H26F7NO3/c1-3-18-10-17(2)11-23(12-18)37-21-8-5-7-20(14-21)35(16-24(36)26(30,31)32)15-19-6-4-9-22(13-19)38-27(33,34)25(28)29/h4-14,24-25,36H,3,15-16H2,1-2H3
Reactome pathway
n/an/a 3.40E+3n/an/an/an/an/an/a
Pharmacia Discovery Research (Pfizer Global Research and Development)
Curated by ChEMBL
Assay Description
Compound was tested in vitro for inhibitory activity against recombinant human cholesteryl ester transfer protein in human serum
J Med Chem 46: 2152-68 (2003)
Article DOI: 10.1021/jm020528+
BindingDB Entry DOI: 10.7270/Q2QV3KWK
Cholesteryl ester transfer protein
(Homo sapiens (Human))
BDBM50128185
(3-((3-(1,1,2,2-tetrafluoroethoxy)benzyl)(3-(3-ethy...)
Show SMILES CCc1cc(C)cc(Oc2cccc(c2)N(CC(O)C(F)(F)F)Cc2cccc(OC(F)(F)C(F)F)c2)c1
Show InChI InChI=1S/C27H26F7NO3/c1-3-18-10-17(2)11-23(12-18)37-21-8-5-7-20(14-21)35(16-24(36)26(30,31)32)15-19-6-4-9-22(13-19)38-27(33,34)25(28)29/h4-14,24-25,36H,3,15-16H2,1-2H3
Reactome pathway
n/an/a 80n/an/an/an/an/an/a
Pharmacia Discovery Research (Pfizer Global Research and Development)
Curated by ChEMBL
Assay Description
Compound was tested in vitro for inhibitory activity against recombinant human cholesteryl ester transfer protein in buffer
J Med Chem 46: 2152-68 (2003)
Article DOI: 10.1021/jm020528+
BindingDB Entry DOI: 10.7270/Q2QV3KWK
Cholesteryl ester transfer protein
(Homo sapiens (Human))
BDBM50128185
(3-((3-(1,1,2,2-tetrafluoroethoxy)benzyl)(3-(3-ethy...)
Show SMILES CCc1cc(C)cc(Oc2cccc(c2)N(CC(O)C(F)(F)F)Cc2cccc(OC(F)(F)C(F)F)c2)c1
Show InChI InChI=1S/C27H26F7NO3/c1-3-18-10-17(2)11-23(12-18)37-21-8-5-7-20(14-21)35(16-24(36)26(30,31)32)15-19-6-4-9-22(13-19)38-27(33,34)25(28)29/h4-14,24-25,36H,3,15-16H2,1-2H3
Reactome pathway
n/an/a 8.00E+4n/an/an/an/an/an/a
TBA
Assay Description
Inhibition of CETP (unknown origin)-mediated [3H]cholesteryl ester transfer from HDL donor particles to LDL acceptor particles
Citation and Details
Article DOI: 10.1007/s00044-004-0104-9
BindingDB Entry DOI: 10.7270/Q2SQ9387
Cholesteryl ester transfer protein
(Oryctolagus cuniculus)
BDBM50128185
(3-((3-(1,1,2,2-tetrafluoroethoxy)benzyl)(3-(3-ethy...)
Show SMILES CCc1cc(C)cc(Oc2cccc(c2)N(CC(O)C(F)(F)F)Cc2cccc(OC(F)(F)C(F)F)c2)c1
Show InChI InChI=1S/C27H26F7NO3/c1-3-18-10-17(2)11-23(12-18)37-21-8-5-7-20(14-21)35(16-24(36)26(30,31)32)15-19-6-4-9-22(13-19)38-27(33,34)25(28)29/h4-14,24-25,36H,3,15-16H2,1-2H3
n/an/a 80n/an/an/an/an/an/a
Al-Zaytoonah Private University of Jordan
Curated by ChEMBL
Assay Description
Inhibition of CETP in rabbit serum after 1 hr by fluorescent cholesteryl esters transfer assay
Eur J Med Chem 45: 1598-617 (2010)
Article DOI: 10.1016/j.ejmech.2009.12.070
BindingDB Entry DOI: 10.7270/Q2VQ32VS
Cholesteryl ester transfer protein
(Homo sapiens (Human))
BDBM50128185
(3-((3-(1,1,2,2-tetrafluoroethoxy)benzyl)(3-(3-ethy...)
Show SMILES CCc1cc(C)cc(Oc2cccc(c2)N(CC(O)C(F)(F)F)Cc2cccc(OC(F)(F)C(F)F)c2)c1
Show InChI InChI=1S/C27H26F7NO3/c1-3-18-10-17(2)11-23(12-18)37-21-8-5-7-20(14-21)35(16-24(36)26(30,31)32)15-19-6-4-9-22(13-19)38-27(33,34)25(28)29/h4-14,24-25,36H,3,15-16H2,1-2H3
Reactome pathway
n/an/a 80n/an/an/an/an/an/a
Universidade Federal da Bahia
Curated by ChEMBL
Assay Description
Inhibition of CETP
Bioorg Med Chem 15: 6242-52 (2007)
Article DOI: 10.1016/j.bmc.2007.06.021
BindingDB Entry DOI: 10.7270/Q2B857VG