BDBM50128464 (S)-2-((S)-2-{[1-((R)-2-Amino-3-mercapto-propionyl)-4-phenyl-piperidine-4-carbonyl]-amino}-4-methyl-pentanoylamino)-propionic acid::CHEMBL56218
SMILES: CC(C)C[C@H](NC(=O)C1(CCN(CC1)C(=O)[C@@H](N)CS)c1ccccc1)C(=O)N[C@@H](C)C(O)=O
InChI Key: InChIKey=ZORLZQLLRSELQH-WDSOQIARSA-N
Data: 2 IC50
Activity Spreadsheet -- Enzyme Inhibition Constant Data from BindingDB
Found 2 hits for monomerid = 50128464
Trg + Lig
Ki
nM
ΔG°
kcal/mole
IC50
nM
Kd
nM
EC50/IC50
nM
koff
s-1
kon
M-1s-1
pHTemp
°C
Geranylgeranyl transferase type I beta subunit/Protein Farnesyltransferase (PFT)
(Homo sapiens (Human))
BDBM50128464
((S)-2-((S)-2-{[1-((R)-2-Amino-3-mercapto-propionyl...)
Show SMILES CC(C)C[C@H](NC(=O)C1(CCN(CC1)C(=O)[C@@H](N)CS)c1ccccc1)C(=O)N[C@@H](C)C(O)=O
Show InChI InChI=1S/C24H36N4O5S/c1-15(2)13-19(20(29)26-16(3)22(31)32)27-23(33)24(17-7-5-4-6-8-17)9-11-28(12-10-24)21(30)18(25)14-34/h4-8,15-16,18-19,34H,9-14,25H2,1-3H3,(H,26,29)(H,27,33)(H,31,32)/t16-,18-,19-/m0/s1
n/an/a 10n/an/an/an/an/an/a
GPC Biotech, Inc.
Curated by ChEMBL
Assay Description
Inhibition of Candida albicans Geranylgeranyl transferase type I
Bioorg Med Chem Lett 13: 1935-7 (2003)
BindingDB Entry DOI: 10.7270/Q2SN08CJ
Protein Farnesyltransferase (PFT)
(Homo sapiens (Human))
BDBM50128464
((S)-2-((S)-2-{[1-((R)-2-Amino-3-mercapto-propionyl...)
Show SMILES CC(C)C[C@H](NC(=O)C1(CCN(CC1)C(=O)[C@@H](N)CS)c1ccccc1)C(=O)N[C@@H](C)C(O)=O
Show InChI InChI=1S/C24H36N4O5S/c1-15(2)13-19(20(29)26-16(3)22(31)32)27-23(33)24(17-7-5-4-6-8-17)9-11-28(12-10-24)21(30)18(25)14-34/h4-8,15-16,18-19,34H,9-14,25H2,1-3H3,(H,26,29)(H,27,33)(H,31,32)/t16-,18-,19-/m0/s1
Reactome pathway
n/an/a 3.00E+3n/an/an/an/an/an/a
GPC Biotech, Inc.
Curated by ChEMBL
Assay Description
Inhibition of Candida albicans Farnesyltransferase
Bioorg Med Chem Lett 13: 1935-7 (2003)
BindingDB Entry DOI: 10.7270/Q2SN08CJ