BDBM50128536 5-(6,7-Dimethoxy-3,4-dihydro-1H-isoquinolin-2-ylmethyl)-pyrimidine-2,4-diamine::CHEMBL77582
SMILES: COc1cc2CCN(Cc3cnc(N)nc3N)Cc2cc1OC
InChI Key: InChIKey=GLXXCDORQLSBNC-UHFFFAOYSA-N
Data: 6 IC50
Activity Spreadsheet -- Enzyme Inhibition Constant Data from BindingDB
Found 6 hits for monomerid = 50128536
Trg + Lig
Ki
nM
ΔG°
kcal/mole
IC50
nM
Kd
nM
EC50/IC50
nM
koff
s-1
kon
M-1s-1
pHTemp
°C
Dihydrofolate reductase
(Homo sapiens (Human))
BDBM50128536
(5-(6,7-Dimethoxy-3,4-dihydro-1H-isoquinolin-2-ylme...)
Show SMILES COc1cc2CCN(Cc3cnc(N)nc3N)Cc2cc1OC
Show InChI InChI=1S/C16H21N5O2/c1-22-13-5-10-3-4-21(8-11(10)6-14(13)23-2)9-12-7-19-16(18)20-15(12)17/h5-7H,3-4,8-9H2,1-2H3,(H4,17,18,19,20)
NCI pathway
Reactome pathway
n/an/a 3.00E+4n/an/an/an/an/an/a
F. Hoffmann-La Roche Ltd.
Curated by ChEMBL
Assay Description
Antibacterial activity against TMP-Resistance Dihydrofolate reductase from Staphylococcus pneumoniae 1/1
J Med Chem 46: 2304-12 (2003)
Article DOI: 10.1021/jm020495y
BindingDB Entry DOI: 10.7270/Q2J38RXV
Dihydrofolate reductase
(Homo sapiens (Human))
BDBM50128536
(5-(6,7-Dimethoxy-3,4-dihydro-1H-isoquinolin-2-ylme...)
Show SMILES COc1cc2CCN(Cc3cnc(N)nc3N)Cc2cc1OC
Show InChI InChI=1S/C16H21N5O2/c1-22-13-5-10-3-4-21(8-11(10)6-14(13)23-2)9-12-7-19-16(18)20-15(12)17/h5-7H,3-4,8-9H2,1-2H3,(H4,17,18,19,20)
NCI pathway
Reactome pathway
n/an/a 210n/an/an/an/an/an/a
F. Hoffmann-La Roche Ltd.
Curated by ChEMBL
Assay Description
Inhibitory activity of TMP-Resistance DHFR against Staphylococcus pneumoniae 1/1
J Med Chem 46: 2304-12 (2003)
Article DOI: 10.1021/jm020495y
BindingDB Entry DOI: 10.7270/Q2J38RXV
Dihydrofolate reductase
(Homo sapiens (Human))
BDBM50128536
(5-(6,7-Dimethoxy-3,4-dihydro-1H-isoquinolin-2-ylme...)
Show SMILES COc1cc2CCN(Cc3cnc(N)nc3N)Cc2cc1OC
Show InChI InChI=1S/C16H21N5O2/c1-22-13-5-10-3-4-21(8-11(10)6-14(13)23-2)9-12-7-19-16(18)20-15(12)17/h5-7H,3-4,8-9H2,1-2H3,(H4,17,18,19,20)
NCI pathway
Reactome pathway
n/an/a>1.00E+5n/an/an/an/an/an/a
F. Hoffmann-La Roche Ltd.
Curated by ChEMBL
Assay Description
Tested for inhibition of TMP-Resistant Dihydrofolate reductase from Staphylococcus aureus 157/4696.
J Med Chem 46: 2304-12 (2003)
Article DOI: 10.1021/jm020495y
BindingDB Entry DOI: 10.7270/Q2J38RXV
Dihydrofolate reductase
(Homo sapiens (Human))
BDBM50128536
(5-(6,7-Dimethoxy-3,4-dihydro-1H-isoquinolin-2-ylme...)
Show SMILES COc1cc2CCN(Cc3cnc(N)nc3N)Cc2cc1OC
Show InChI InChI=1S/C16H21N5O2/c1-22-13-5-10-3-4-21(8-11(10)6-14(13)23-2)9-12-7-19-16(18)20-15(12)17/h5-7H,3-4,8-9H2,1-2H3,(H4,17,18,19,20)
NCI pathway
Reactome pathway
n/an/a 210n/an/an/an/an/an/a
F. Hoffmann-La Roche Ltd.
Curated by ChEMBL
Assay Description
Inhibitory activity of TMP-susceptible Dihydrofolate reductase against Staphylococcus pneumoniae ATCC 49619
J Med Chem 46: 2304-12 (2003)
Article DOI: 10.1021/jm020495y
BindingDB Entry DOI: 10.7270/Q2J38RXV
Dihydrofolate reductase
(Homo sapiens (Human))
BDBM50128536
(5-(6,7-Dimethoxy-3,4-dihydro-1H-isoquinolin-2-ylme...)
Show SMILES COc1cc2CCN(Cc3cnc(N)nc3N)Cc2cc1OC
Show InChI InChI=1S/C16H21N5O2/c1-22-13-5-10-3-4-21(8-11(10)6-14(13)23-2)9-12-7-19-16(18)20-15(12)17/h5-7H,3-4,8-9H2,1-2H3,(H4,17,18,19,20)
NCI pathway
Reactome pathway
n/an/a 10n/an/an/an/an/an/a
F. Hoffmann-La Roche Ltd.
Curated by ChEMBL
Assay Description
Antibacterial activity of the compound against TMP-susceptible Dihydrofolate reductase from Staphylococcus pneumoniae ATCC 49619
J Med Chem 46: 2304-12 (2003)
Article DOI: 10.1021/jm020495y
BindingDB Entry DOI: 10.7270/Q2J38RXV
Dihydrofolate reductase
(Homo sapiens (Human))
BDBM50128536
(5-(6,7-Dimethoxy-3,4-dihydro-1H-isoquinolin-2-ylme...)
Show SMILES COc1cc2CCN(Cc3cnc(N)nc3N)Cc2cc1OC
Show InChI InChI=1S/C16H21N5O2/c1-22-13-5-10-3-4-21(8-11(10)6-14(13)23-2)9-12-7-19-16(18)20-15(12)17/h5-7H,3-4,8-9H2,1-2H3,(H4,17,18,19,20)
NCI pathway
Reactome pathway
n/an/a 3.00E+4n/an/an/an/an/an/a
F. Hoffmann-La Roche Ltd.
Curated by ChEMBL
Assay Description
Inhibitory activity of TMP-Resistance DHFR against Staphylococcus aureus 157/4696
J Med Chem 46: 2304-12 (2003)
Article DOI: 10.1021/jm020495y
BindingDB Entry DOI: 10.7270/Q2J38RXV