BDBM50128552 (3S,10R,13S)-17-Benzotriazol-1-yl-10,13-dimethyl-2,3,4,7,8,9,10,11,12,13,14,15-dodecahydro-1H-cyclopenta[a]phenanthren-3-ol::CHEMBL78222
SMILES: C[C@]12CCC3C(CC=C4C[C@@H](O)CC[C@]34C)C1CC=C2n1nnc2ccccc12
InChI Key: InChIKey=MDYLOCDGCAUDBS-UFOVVPIISA-N
Data: 2 IC50
Activity Spreadsheet -- Enzyme Inhibition Constant Data from BindingDB
Found 2 hits for monomerid = 50128552
Trg + Lig
Ki
nM
ΔG°
kcal/mole
IC50
nM
Kd
nM
EC50/IC50
nM
koff
s-1
kon
M-1s-1
pHTemp
°C
Cytochrome P450 17A1
(Homo sapiens (Human))
BDBM50128552
((3S,10R,13S)-17-Benzotriazol-1-yl-10,13-dimethyl-2...)
Show SMILES C[C@]12CCC3C(CC=C4C[C@@H](O)CC[C@]34C)C1CC=C2n1nnc2ccccc12 |c:21,t:7|
Show InChI InChI=1S/C25H31N3O/c1-24-13-11-17(29)15-16(24)7-8-18-19-9-10-23(25(19,2)14-12-20(18)24)28-22-6-4-3-5-21(22)26-27-28/h3-7,10,17-20,29H,8-9,11-15H2,1-2H3/t17-,18?,19?,20?,24-,25-/m0/s1
Reactome pathway
n/an/a 1.25E+3n/an/an/an/an/an/a
University of Maryland
Curated by ChEMBL
Assay Description
In vitro inhibitory concentration against Cytochrome P450 17 expressed in Escherichia coli
J Med Chem 48: 2972-84 (2005)
Article DOI: 10.1021/jm040202w
BindingDB Entry DOI: 10.7270/Q2TH8NHV
Cytochrome P450 17A1
(Homo sapiens (Human))
BDBM50128552
((3S,10R,13S)-17-Benzotriazol-1-yl-10,13-dimethyl-2...)
Show SMILES C[C@]12CCC3C(CC=C4C[C@@H](O)CC[C@]34C)C1CC=C2n1nnc2ccccc12 |c:21,t:7|
Show InChI InChI=1S/C25H31N3O/c1-24-13-11-17(29)15-16(24)7-8-18-19-9-10-23(25(19,2)14-12-20(18)24)28-22-6-4-3-5-21(22)26-27-28/h3-7,10,17-20,29H,8-9,11-15H2,1-2H3/t17-,18?,19?,20?,24-,25-/m0/s1
Reactome pathway
n/an/a 1.25E+3n/an/an/an/an/an/a
Accelrys
Curated by ChEMBL
Assay Description
In vitro cytochrome P450 17A1 inhibition was assayed using the rapid acetic acid releasing assay (AARA), utilizing intact P450c17-expressing Escheric...
J Med Chem 46: 2345-51 (2003)
Article DOI: 10.1021/jm020576u
BindingDB Entry DOI: 10.7270/Q2WD41B7