BDBM50128563 ((3S,10R,13R)-3-Hydroxy-10,13-dimethyl-2,3,4,7,8,9,10,11,12,13,14,15,16,17-tetradecahydro-1H-cyclopenta[a]phenanthren-17-yl)-acetaldehyde oxime::CHEMBL77288
SMILES: C[C@]12CCC3C(CC=C4C[C@@H](O)CC[C@]34C)C1CCC2CCN=O
InChI Key: InChIKey=XWXDGLDMLXDRKR-VDTAABSNSA-N
Data: 1 IC50
Activity Spreadsheet -- Enzyme Inhibition Constant Data from BindingDB
Found 1 hit for monomerid = 50128563
Trg + Lig
Ki
nM
ΔG°
kcal/mole
IC50
nM
Kd
nM
EC50/IC50
nM
koff
s-1
kon
M-1s-1
pHTemp
°C
Cytochrome P450 17A1
(Homo sapiens (Human))
BDBM50128563
(((3S,10R,13R)-3-Hydroxy-10,13-dimethyl-2,3,4,7,8,9...)
Show SMILES C[C@]12CCC3C(CC=C4C[C@@H](O)CC[C@]34C)C1CCC2CCN=O |t:7|
Show InChI InChI=1S/C21H33NO2/c1-20-11-8-19-17(18(20)6-4-14(20)9-12-22-24)5-3-15-13-16(23)7-10-21(15,19)2/h3,14,16-19,23H,4-13H2,1-2H3/t14?,16-,17?,18?,19?,20+,21-/m0/s1
Reactome pathway
n/an/a 450n/an/an/an/an/an/a
Accelrys
Curated by ChEMBL
Assay Description
In vitro cytochrome P450 17A1 inhibition was assayed using the rapid acetic acid releasing assay (AARA), utilizing intact P450c17-expressing Escheric...
J Med Chem 46: 2345-51 (2003)
Article DOI: 10.1021/jm020576u
BindingDB Entry DOI: 10.7270/Q2WD41B7