BDBM50128650 1-Biphenyl-4-ylmethyl-4-(4-methoxy-benzenesulfonyl)-piperidine-4-carboxylic acid hydroxyamide::CHEMBL76137
SMILES: COc1ccc(cc1)S(=O)(=O)C1(CCN(Cc2ccc(cc2)-c2ccccc2)CC1)C(=O)NO
InChI Key: InChIKey=UTDYWIPXAVCYCE-UHFFFAOYSA-N
Data: 4 IC50
Activity Spreadsheet -- Enzyme Inhibition Constant Data from BindingDB
Found 4 hits for monomerid = 50128650
Trg + Lig
Ki
nM
ΔG°
kcal/mole
IC50
nM
Kd
nM
EC50/IC50
nM
koff
s-1
kon
M-1s-1
pHTemp
°C
Disintegrin and metalloproteinase domain-containing protein 17
(Homo sapiens (Human))
BDBM50128650
(1-Biphenyl-4-ylmethyl-4-(4-methoxy-benzenesulfonyl...)
Show SMILES COc1ccc(cc1)S(=O)(=O)C1(CCN(Cc2ccc(cc2)-c2ccccc2)CC1)C(=O)NO
Show InChI InChI=1S/C26H28N2O5S/c1-33-23-11-13-24(14-12-23)34(31,32)26(25(29)27-30)15-17-28(18-16-26)19-20-7-9-22(10-8-20)21-5-3-2-4-6-21/h2-14,30H,15-19H2,1H3,(H,27,29)
Reactome pathway
n/an/a 610n/an/an/an/an/an/a
Wyeth Research
Curated by ChEMBL
Assay Description
In vitro inhibitory activity against tumor necrosis factor alpha converting enzyme (TACE).
J Med Chem 46: 2376-96 (2003)
Article DOI: 10.1021/jm0205550
BindingDB Entry DOI: 10.7270/Q2N0178C
Collagenase 3
(Homo sapiens (Human))
BDBM50128650
(1-Biphenyl-4-ylmethyl-4-(4-methoxy-benzenesulfonyl...)
Show SMILES COc1ccc(cc1)S(=O)(=O)C1(CCN(Cc2ccc(cc2)-c2ccccc2)CC1)C(=O)NO
Show InChI InChI=1S/C26H28N2O5S/c1-33-23-11-13-24(14-12-23)34(31,32)26(25(29)27-30)15-17-28(18-16-26)19-20-7-9-22(10-8-20)21-5-3-2-4-6-21/h2-14,30H,15-19H2,1H3,(H,27,29)
NCI pathway
Reactome pathway
n/an/a 3n/an/an/an/an/an/a
Wyeth Research
Curated by ChEMBL
Assay Description
In vitro inhibitory activity against matrix metalloprotease-13.
J Med Chem 46: 2376-96 (2003)
Article DOI: 10.1021/jm0205550
BindingDB Entry DOI: 10.7270/Q2N0178C
Interstitial collagenase
(Homo sapiens (Human))
BDBM50128650
(1-Biphenyl-4-ylmethyl-4-(4-methoxy-benzenesulfonyl...)
Show SMILES COc1ccc(cc1)S(=O)(=O)C1(CCN(Cc2ccc(cc2)-c2ccccc2)CC1)C(=O)NO
Show InChI InChI=1S/C26H28N2O5S/c1-33-23-11-13-24(14-12-23)34(31,32)26(25(29)27-30)15-17-28(18-16-26)19-20-7-9-22(10-8-20)21-5-3-2-4-6-21/h2-14,30H,15-19H2,1H3,(H,27,29)
Reactome pathway
n/an/a 1.33E+3n/an/an/an/an/an/a
Wyeth Research
Curated by ChEMBL
Assay Description
In vitro inhibitory activity against matrix metalloprotease-1
J Med Chem 46: 2376-96 (2003)
Article DOI: 10.1021/jm0205550
BindingDB Entry DOI: 10.7270/Q2N0178C
Matrix metalloproteinase-9
(Homo sapiens (Human))
BDBM50128650
(1-Biphenyl-4-ylmethyl-4-(4-methoxy-benzenesulfonyl...)
Show SMILES COc1ccc(cc1)S(=O)(=O)C1(CCN(Cc2ccc(cc2)-c2ccccc2)CC1)C(=O)NO
Show InChI InChI=1S/C26H28N2O5S/c1-33-23-11-13-24(14-12-23)34(31,32)26(25(29)27-30)15-17-28(18-16-26)19-20-7-9-22(10-8-20)21-5-3-2-4-6-21/h2-14,30H,15-19H2,1H3,(H,27,29)
Reactome pathway
n/an/a 13n/an/an/an/an/an/a
Wyeth Research
Curated by ChEMBL
Assay Description
In vitro inhibitory activity against matrix metalloprotease-9.
J Med Chem 46: 2376-96 (2003)
Article DOI: 10.1021/jm0205550
BindingDB Entry DOI: 10.7270/Q2N0178C