BDBM50128831 CHEMBL3629356
SMILES: O[C@@H](CNCCCCCCCCCN1CCC(Cn2cnc(n2)C(O)(c2ccccc2)c2ccccc2)CC1)c1ccc(O)c2[nH]c(=O)ccc12
InChI Key: InChIKey=OZJWNVOXXCSPRM-QNGWXLTQSA-N
Data: 1 KI  1 EC50
Activity Spreadsheet -- Enzyme Inhibition Constant Data from BindingDB
Found 2 hits for monomerid = 50128831
Trg + Lig
Ki
nM
ΔG°
kcal/mole
IC50
nM
Kd
nM
EC50/IC50
nM
koff
s-1
kon
M-1s-1
pHTemp
°C
Muscarinic acetylcholine receptor M3
(Homo sapiens (Human))
BDBM50128831
(CHEMBL3629356)
Show SMILES O[C@@H](CNCCCCCCCCCN1CCC(Cn2cnc(n2)C(O)(c2ccccc2)c2ccccc2)CC1)c1ccc(O)c2[nH]c(=O)ccc12 |r|
Show InChI InChI=1S/C41H52N6O4/c48-36-20-18-34(35-19-21-38(50)44-39(35)36)37(49)28-42-24-12-4-2-1-3-5-13-25-46-26-22-31(23-27-46)29-47-30-43-40(45-47)41(51,32-14-8-6-9-15-32)33-16-10-7-11-17-33/h6-11,14-21,30-31,37,42,48-49,51H,1-5,12-13,22-29H2,(H,44,50)/t37-/m0/s1
Reactome pathway
3.70n/an/an/an/an/an/an/an/a
Pfizer
Curated by ChEMBL
Assay Description
Displacement of [3H]N-methyl scopolamine from human cloned muscarinic M3 receptor by dilution method
Bioorg Med Chem Lett 25: 5121-6 (2015)
BindingDB Entry DOI: 10.7270/Q2JQ12V7
Beta-2 adrenergic receptor
(Homo sapiens (Human))
BDBM50128831
(CHEMBL3629356)
Show SMILES O[C@@H](CNCCCCCCCCCN1CCC(Cn2cnc(n2)C(O)(c2ccccc2)c2ccccc2)CC1)c1ccc(O)c2[nH]c(=O)ccc12 |r|
Show InChI InChI=1S/C41H52N6O4/c48-36-20-18-34(35-19-21-38(50)44-39(35)36)37(49)28-42-24-12-4-2-1-3-5-13-25-46-26-22-31(23-27-46)29-47-30-43-40(45-47)41(51,32-14-8-6-9-15-32)33-16-10-7-11-17-33/h6-11,14-21,30-31,37,42,48-49,51H,1-5,12-13,22-29H2,(H,44,50)/t37-/m0/s1
Reactome pathway
n/an/an/an/a 13n/an/an/an/a
Pfizer
Curated by ChEMBL
Assay Description
Agonist activity at human beta2 adrenoceptor expressed in CHO cells assessed as stumulation of intracellular cAMP production
Bioorg Med Chem Lett 25: 5121-6 (2015)
BindingDB Entry DOI: 10.7270/Q2JQ12V7